{"text_format":"1","workbook":"xlsx","n_sheets":4,"sheets":["制单","INVOICE","PACKING LIST","重量与单价数据"],"not_rendered":{"charts":0,"images":0,"macros":1,"external_links":2,"defined_names":0,"comments":1,"pivot_tables":0},"unopened":[],"bounds":{"document_bytes":16777216,"sheet_cells":100000,"rows_first":2000,"rows_last":500,"rows_between":2000,"halvings":0,"cell_chars":16384,"cell_head_chars":4096},"cells_cut":0,"cells_raw":0,"read":"whole","date_system":"1900"}

{"sheet":"制单","index":0,"n_rows":21,"n_cols":17,"rows_kept":21,"cut":false,"hidden":false,"merged":[[0,1,0,6],[0,9,0,10]]}
[null,null,null,null,null,null,null,null,"备货日期：",{"$f":"NOW()","v":"2018-01-30T21:45:22.720"},null,null,null,null,null,18,"1、确认《shipping schedule》对包装\\标签等的特殊要求，包括Packing Instruction和Remarks；如PING客户必须有PO号及出货日期的标签；ORGA要求有ORGA ITEM CODE,以及良品或不良，P、N以及真假杆的情形；"]
["Product  SKU","company\nsp","SKU Desc","Order Qty","Finish Products in warehouse","(23-Jun)Plan Qty","Actually \nShip Qty","unit\nweight","CTN\nWEIGHT","on-hand\n QTY","Insufficient\nQTY","category","remak1+不良+分类","CTN","ODD","SIZE","2、将《shipping schedule》中的计划复制到此表，然后做《数据透视表》；"]
["产品品名","代码","包装量","定单数","入库的成品数","6月23日的计划出货数","实际出货数","单重（g）","箱重","现有库存","不够数量","类别","备注","箱数","零头","纸箱类型","3、将《数据透视表》数据复制到《制单》，按成品大类排序，然后考虑按数量排序（因数量少的需合并）；"]
["BAL-SQRB-11052",{"$f":"VLOOKUP(A:A,[1]重量与单价数据!A$1:F$65536,6,0)","v":385},{"$f":"VLOOKUP(A:A,[1]重量与单价数据!A$1:G$65536,4,0)","v":50},null,null,null,295,{"$f":"VLOOKUP(A:A,[1]重量与单价数据!A$1:C$65536,3,0)","v":326},{"$f":"VLOOKUP(A:A,[1]重量与单价数据!A$1:E$65536,5,0)","v":1.48},null,{"$f":"J4-G4","v":-295},{"$f":"VLOOKUP(A:A,[1]重量与单价数据!A$1:G$65536,7,0)","v":"Shaft"},{"$f":"VLOOKUP(A:A,重量与单价数据!A$1:P$65536,16,0)","v":0},{"$f":"CEILING(G4/C4,1)","v":6},{"$f":"G4-FLOOR(G4,C4)","v":45},{"$f":"VLOOKUP(A:A,重量与单价数据!A$1:H$65536,8,0)","v":"145*29*16"}]
["TAQ-1125-ST-CB-70041",{"$f":"VLOOKUP(A:A,[1]重量与单价数据!A$1:F$65536,6,0)","v":386},{"$f":"VLOOKUP(A:A,[1]重量与单价数据!A$1:G$65536,4,0)","v":1},null,null,null,36,{"$f":"VLOOKUP(A:A,[1]重量与单价数据!A$1:C$65536,3,0)","v":430},{"$f":"VLOOKUP(A:A,[1]重量与单价数据!A$1:E$65536,5,0)","v":0.5},null,{"$f":"J5-G5","v":-36},{"$f":"VLOOKUP(A:A,[1]重量与单价数据!A$1:G$65536,7,0)","v":"fork"},{"$f":"VLOOKUP(A:A,重量与单价数据!A$1:P$65536,16,0)","v":0},{"$f":"CEILING(G5/C5,1)","v":36},{"$f":"G5-FLOOR(G5,C5)","v":0},{"$f":"VLOOKUP(A:A,重量与单价数据!A$1:H$65536,8,0)","v":"89*14*9"}]
["ULAUNCH145TS-46",{"$f":"VLOOKUP(A:A,[1]重量与单价数据!A$1:F$65536,6,0)","v":340},{"$f":"VLOOKUP(A:A,[1]重量与单价数据!A$1:G$65536,4,0)","v":50},null,null,null,234,{"$f":"VLOOKUP(A:A,[1]重量与单价数据!A$1:C$65536,3,0)","v":99},{"$f":"VLOOKUP(A:A,[1]重量与单价数据!A$1:E$65536,5,0)","v":0.6},null,-234,{"$f":"VLOOKUP(A:A,[1]重量与单价数据!A$1:G$65536,7,0)","v":"golf"},{"$f":"VLOOKUP(A:A,重量与单价数据!A$1:P$65536,16,0)","v":0},5,34,{"$f":"VLOOKUP(A:A,重量与单价数据!A$1:H$65536,8,0)","v":"122*15*10"}]
["GSAL355IS-40-T",{"$f":"VLOOKUP(A:A,[1]重量与单价数据!A$1:F$65536,6,0)","v":765},{"$f":"VLOOKUP(A:A,[1]重量与单价数据!A$1:G$65536,4,0)","v":50},null,null,null,18,{"$f":"VLOOKUP(A:A,[1]重量与单价数据!A$1:C$65536,3,0)","v":72},{"$f":"VLOOKUP(A:A,[1]重量与单价数据!A$1:E$65536,5,0)","v":0.6},null,{"$f":"J7-G7","v":-18},{"$f":"VLOOKUP(A:A,[1]重量与单价数据!A$1:G$65536,7,0)","v":"golf"},{"$f":"VLOOKUP(A:A,重量与单价数据!A$1:P$65536,16,0)","v":0},{"$f":"CEILING(G7/C7,1)","v":1},{"$f":"G7-FLOOR(G7,C7)","v":18},{"$f":"VLOOKUP(A:A,重量与单价数据!A$1:H$65536,8,0)","v":"122*15*10"}]
["TAQEX-1125-ST-CB-70044",{"$f":"VLOOKUP(A:A,[1]重量与单价数据!A$1:F$65536,6,0)","v":339},{"$f":"VLOOKUP(A:A,[1]重量与单价数据!A$1:G$65536,4,0)","v":1},null,null,null,50,{"$f":"VLOOKUP(A:A,[1]重量与单价数据!A$1:C$65536,3,0)","v":430},{"$f":"VLOOKUP(A:A,[1]重量与单价数据!A$1:E$65536,5,0)","v":0.5},null,-50,{"$f":"VLOOKUP(A:A,[1]重量与单价数据!A$1:G$65536,7,0)","v":"fork"},{"$f":"VLOOKUP(A:A,重量与单价数据!A$1:P$65536,16,0)","v":0},50,0,{"$f":"VLOOKUP(A:A,重量与单价数据!A$1:H$65536,8,0)","v":"89*14*9"}]
["ULAUNCH145TS-46",{"$f":"VLOOKUP(A:A,[1]重量与单价数据!A$1:F$65536,6,0)","v":340},{"$f":"VLOOKUP(A:A,[1]重量与单价数据!A$1:G$65536,4,0)","v":50},null,null,null,234,{"$f":"VLOOKUP(A:A,[1]重量与单价数据!A$1:C$65536,3,0)","v":99},{"$f":"VLOOKUP(A:A,[1]重量与单价数据!A$1:E$65536,5,0)","v":0.6},null,-234,{"$f":"VLOOKUP(A:A,[1]重量与单价数据!A$1:G$65536,7,0)","v":"golf"},{"$f":"VLOOKUP(A:A,重量与单价数据!A$1:P$65536,16,0)","v":0},5,34,{"$f":"VLOOKUP(A:A,重量与单价数据!A$1:H$65536,8,0)","v":"122*15*10"}]
["GSAL355IS-40-T",{"$f":"VLOOKUP(A:A,[1]重量与单价数据!A$1:F$65536,6,0)","v":765},{"$f":"VLOOKUP(A:A,[1]重量与单价数据!A$1:G$65536,4,0)","v":50},null,null,null,18,{"$f":"VLOOKUP(A:A,[1]重量与单价数据!A$1:C$65536,3,0)","v":72},{"$f":"VLOOKUP(A:A,[1]重量与单价数据!A$1:E$65536,5,0)","v":0.6},null,-18,{"$f":"VLOOKUP(A:A,[1]重量与单价数据!A$1:G$65536,7,0)","v":"golf"},{"$f":"VLOOKUP(A:A,重量与单价数据!A$1:P$65536,16,0)","v":0},1,18,{"$f":"VLOOKUP(A:A,重量与单价数据!A$1:H$65536,8,0)","v":"122*15*10"}]
["CCM-V8-TT-4556",{"$f":"VLOOKUP(A:A,[1]重量与单价数据!A$1:F$65536,6,0)","v":766},{"$f":"VLOOKUP(A:A,[1]重量与单价数据!A$1:G$65536,4,0)","v":50},null,null,null,25,{"$f":"VLOOKUP(A:A,[1]重量与单价数据!A$1:C$65536,3,0)","v":380},{"$f":"VLOOKUP(A:A,[1]重量与单价数据!A$1:E$65536,5,0)","v":1.48},null,-25,{"$f":"VLOOKUP(A:A,[1]重量与单价数据!A$1:G$65536,7,0)","v":"shaft"},{"$f":"VLOOKUP(A:A,重量与单价数据!A$1:P$65536,16,0)","v":0},1,25,{"$f":"VLOOKUP(A:A,重量与单价数据!A$1:H$65536,8,0)","v":"145*29*16"}]
["SHR-RM19-P225-G01L-57",{"$f":"VLOOKUP(A:A,[1]重量与单价数据!A$1:F$65536,6,0)","v":1496},{"$f":"VLOOKUP(A:A,[1]重量与单价数据!A$1:G$65536,4,0)","v":12},null,null,null,25,{"$f":"VLOOKUP(A:A,[1]重量与单价数据!A$1:C$65536,3,0)","v":740},{"$f":"VLOOKUP(A:A,[1]重量与单价数据!A$1:E$65536,5,0)","v":2.2200000000000002},null,{"$f":"J12-G12","v":-25},{"$f":"VLOOKUP(A:A,[1]重量与单价数据!A$1:G$65536,7,0)","v":"goalier"},{"$f":"VLOOKUP(A:A,重量与单价数据!A$1:P$65536,16,0)","v":0},{"$f":"CEILING(G12/C12,1)","v":3},{"$f":"G12-FLOOR(G12,C12)","v":1},{"$f":"VLOOKUP(A:A,重量与单价数据!A$1:H$65536,8,0)","v":"179*42*15"}]
["SHR-RM19-P225-G01L-57",{"$f":"VLOOKUP(A:A,[1]重量与单价数据!A$1:F$65536,6,0)","v":1496},{"$f":"VLOOKUP(A:A,[1]重量与单价数据!A$1:G$65536,4,0)","v":12},null,null,null,25,{"$f":"VLOOKUP(A:A,[1]重量与单价数据!A$1:C$65536,3,0)","v":740},{"$f":"VLOOKUP(A:A,[1]重量与单价数据!A$1:E$65536,5,0)","v":2.2200000000000002},null,{"$f":"J13-G13","v":-25},{"$f":"VLOOKUP(A:A,[1]重量与单价数据!A$1:G$65536,7,0)","v":"goalier"},{"$f":"VLOOKUP(A:A,重量与单价数据!A$1:P$65536,16,0)","v":0},{"$f":"CEILING(G13/C13,1)","v":3},{"$f":"G13-FLOOR(G13,C13)","v":1},{"$f":"VLOOKUP(A:A,重量与单价数据!A$1:H$65536,8,0)","v":"179*42*15"}]
["GSAL355IS-40-T",{"$f":"VLOOKUP(A:A,[1]重量与单价数据!A$1:F$65536,6,0)","v":765},{"$f":"VLOOKUP(A:A,[1]重量与单价数据!A$1:G$65536,4,0)","v":50},null,null,null,18,{"$f":"VLOOKUP(A:A,[1]重量与单价数据!A$1:C$65536,3,0)","v":72},{"$f":"VLOOKUP(A:A,[1]重量与单价数据!A$1:E$65536,5,0)","v":0.6},null,-18,{"$f":"VLOOKUP(A:A,[1]重量与单价数据!A$1:G$65536,7,0)","v":"golf"},{"$f":"VLOOKUP(A:A,重量与单价数据!A$1:P$65536,16,0)","v":0},1,18,{"$f":"VLOOKUP(A:A,重量与单价数据!A$1:H$65536,8,0)","v":"122*15*10"}]
["TAQEX-1125-ST-CB-70044",{"$f":"VLOOKUP(A:A,[1]重量与单价数据!A$1:F$65536,6,0)","v":339},{"$f":"VLOOKUP(A:A,[1]重量与单价数据!A$1:G$65536,4,0)","v":1},null,null,null,50,{"$f":"VLOOKUP(A:A,[1]重量与单价数据!A$1:C$65536,3,0)","v":430},{"$f":"VLOOKUP(A:A,[1]重量与单价数据!A$1:E$65536,5,0)","v":0.5},null,-50,{"$f":"VLOOKUP(A:A,[1]重量与单价数据!A$1:G$65536,7,0)","v":"fork"},{"$f":"VLOOKUP(A:A,重量与单价数据!A$1:P$65536,16,0)","v":0},50,0,{"$f":"VLOOKUP(A:A,重量与单价数据!A$1:H$65536,8,0)","v":"89*14*9"}]
["ULAUNCH145TS-46",{"$f":"VLOOKUP(A:A,[1]重量与单价数据!A$1:F$65536,6,0)","v":340},{"$f":"VLOOKUP(A:A,[1]重量与单价数据!A$1:G$65536,4,0)","v":50},null,null,null,234,{"$f":"VLOOKUP(A:A,[1]重量与单价数据!A$1:C$65536,3,0)","v":99},{"$f":"VLOOKUP(A:A,[1]重量与单价数据!A$1:E$65536,5,0)","v":0.6},null,-234,{"$f":"VLOOKUP(A:A,[1]重量与单价数据!A$1:G$65536,7,0)","v":"golf"},{"$f":"VLOOKUP(A:A,重量与单价数据!A$1:P$65536,16,0)","v":0},5,34,{"$f":"VLOOKUP(A:A,重量与单价数据!A$1:H$65536,8,0)","v":"122*15*10"}]
["GSAL355IS-40-T",{"$f":"VLOOKUP(A:A,[1]重量与单价数据!A$1:F$65536,6,0)","v":765},{"$f":"VLOOKUP(A:A,[1]重量与单价数据!A$1:G$65536,4,0)","v":50},null,null,null,18,{"$f":"VLOOKUP(A:A,[1]重量与单价数据!A$1:C$65536,3,0)","v":72},{"$f":"VLOOKUP(A:A,[1]重量与单价数据!A$1:E$65536,5,0)","v":0.6},null,-18,{"$f":"VLOOKUP(A:A,[1]重量与单价数据!A$1:G$65536,7,0)","v":"golf"},{"$f":"VLOOKUP(A:A,重量与单价数据!A$1:P$65536,16,0)","v":0},1,18,{"$f":"VLOOKUP(A:A,重量与单价数据!A$1:H$65536,8,0)","v":"122*15*10"}]
["CCM-V8-TT-4556",{"$f":"VLOOKUP(A:A,[1]重量与单价数据!A$1:F$65536,6,0)","v":766},{"$f":"VLOOKUP(A:A,[1]重量与单价数据!A$1:G$65536,4,0)","v":50},null,null,null,25,{"$f":"VLOOKUP(A:A,[1]重量与单价数据!A$1:C$65536,3,0)","v":380},{"$f":"VLOOKUP(A:A,[1]重量与单价数据!A$1:E$65536,5,0)","v":1.48},null,-25,{"$f":"VLOOKUP(A:A,[1]重量与单价数据!A$1:G$65536,7,0)","v":"shaft"},{"$f":"VLOOKUP(A:A,重量与单价数据!A$1:P$65536,16,0)","v":0},1,25,{"$f":"VLOOKUP(A:A,重量与单价数据!A$1:H$65536,8,0)","v":"145*29*16"}]
["SHR-RM19-P225-G01L-57",{"$f":"VLOOKUP(A:A,[1]重量与单价数据!A$1:F$65536,6,0)","v":1496},{"$f":"VLOOKUP(A:A,[1]重量与单价数据!A$1:G$65536,4,0)","v":12},null,null,null,25,{"$f":"VLOOKUP(A:A,[1]重量与单价数据!A$1:C$65536,3,0)","v":740},{"$f":"VLOOKUP(A:A,[1]重量与单价数据!A$1:E$65536,5,0)","v":2.2200000000000002},null,{"$f":"J19-G19","v":-25},{"$f":"VLOOKUP(A:A,[1]重量与单价数据!A$1:G$65536,7,0)","v":"goalier"},{"$f":"VLOOKUP(A:A,重量与单价数据!A$1:P$65536,16,0)","v":0},{"$f":"CEILING(G19/C19,1)","v":3},{"$f":"G19-FLOOR(G19,C19)","v":1},{"$f":"VLOOKUP(A:A,重量与单价数据!A$1:H$65536,8,0)","v":"179*42*15"}]
["SHR-RM19-P225-G01L-57",{"$f":"VLOOKUP(A:A,[1]重量与单价数据!A$1:F$65536,6,0)","v":1496},{"$f":"VLOOKUP(A:A,[1]重量与单价数据!A$1:G$65536,4,0)","v":12},null,null,null,25,{"$f":"VLOOKUP(A:A,[1]重量与单价数据!A$1:C$65536,3,0)","v":740},{"$f":"VLOOKUP(A:A,[1]重量与单价数据!A$1:E$65536,5,0)","v":2.2200000000000002},null,{"$f":"J20-G20","v":-25},{"$f":"VLOOKUP(A:A,[1]重量与单价数据!A$1:G$65536,7,0)","v":"goalier"},{"$f":"VLOOKUP(A:A,重量与单价数据!A$1:P$65536,16,0)","v":0},{"$f":"CEILING(G20/C20,1)","v":3},{"$f":"G20-FLOOR(G20,C20)","v":1},{"$f":"VLOOKUP(A:A,重量与单价数据!A$1:H$65536,8,0)","v":"179*42*15"}]
["Total",null,null,null,null,null,{"$f":"SUM(G$1:G20)","v":1355},null,null,null,null,null,null,{"$f":"SUM(N$1:N20)","v":175}]

{"sheet":"INVOICE","index":1,"n_rows":55,"n_cols":11,"rows_kept":55,"cut":false,"hidden":false,"merged":[[6,0,6,9],[0,0,0,9],[1,0,1,9],[2,0,2,9],[3,0,3,9],[5,0,5,9],[9,0,9,4],[12,0,12,3],[13,1,13,2],[13,4,13,7],[16,1,16,3],[16,4,16,5],[16,6,16,9]]}
["绩能复合材料制品（广州）有限公司"]
["JI NENG COMPOSITE MATERIALS & PRODUCTS (GUANGZHOU) LTD."]
["728 Xiagang Blvd., Heng Yun Building 5F Guangzhou Economic & Technology Development District"]
["TEL:86-20-22321015 FAX: 86-757-82209433"]
[]
["发票"]
["COMMERCIAL  INVOICE"]
[null,null,null,null,null,null,null,"Invoice No.:","JEC-05??"]
["To Messrs:",null,null,null,null,null,null,"Date:","2005-05-11"]
["TRUE TEMPER SPORTS INC."]
["                   ADD: 1020 North Marshall Aven. El Cajon, CA 92020",null,null,null,null,null,null,null,25]
[]
[]
["From ","GUANGZHOU,CHINA",null,"To","Hong Kong"]
[]
[]
["Marks & No.","Description Of Goods",null,null,"Unit Price",null,"Amount "]
[null,null,null,null,null,"CNF LOSANGELES"]
[null,"BAL-SQRB-11052",null,295,"PCS",{"$f":"VLOOKUP(B:B,重量与单价数据!A:B,2,0)","v":9},null,{"$f":"D19*F19","v":2655},null,null,{"$f":"VLOOKUP(B:B,重量与单价数据!A:D,4,0)","v":50}]
[]
[null,"TAQ-1125-ST-CB-70041",null,36,"PCS",{"$f":"VLOOKUP(B:B,重量与单价数据!A:B,2,0)","v":9},null,{"$f":"D21*F21","v":324},null,null,{"$f":"VLOOKUP(B:B,重量与单价数据!A:D,4,0)","v":1}]
[]
[null,"ULAUNCH145TS-46",null,234,"PCS",{"$f":"VLOOKUP(B:B,重量与单价数据!A:B,2,0)","v":9},null,{"$f":"D23*F23","v":2106},null,null,{"$f":"VLOOKUP(B:B,重量与单价数据!A:D,4,0)","v":50}]
[]
[null,"GSAL355IS-40-T",null,18,"PCS",{"$f":"VLOOKUP(B:B,重量与单价数据!A:B,2,0)","v":9},null,{"$f":"D25*F25","v":162},null,null,{"$f":"VLOOKUP(B:B,重量与单价数据!A:D,4,0)","v":50}]
[]
[null,"TAQEX-1125-ST-CB-70044",null,50,"PCS",{"$f":"VLOOKUP(B:B,重量与单价数据!A:B,2,0)","v":9},null,{"$f":"D27*F27","v":450},null,null,{"$f":"VLOOKUP(B:B,重量与单价数据!A:D,4,0)","v":1}]
[]
[null,"ULAUNCH145TS-46",null,234,"PCS",{"$f":"VLOOKUP(B:B,重量与单价数据!A:B,2,0)","v":9},null,{"$f":"D29*F29","v":2106},null,null,{"$f":"VLOOKUP(B:B,重量与单价数据!A:D,4,0)","v":50}]
[]
{"$rows_left_out":26}
{"sheet":"PACKING LIST","index":2,"n_rows":79,"n_cols":22,"rows_kept":79,"cut":false,"hidden":false,"merged":[[16,10,17,10],[16,11,17,11],[16,12,17,12],[16,13,17,13],[16,14,17,14],[16,15,17,15],[17,4,17,5],[17,6,17,7],[17,8,17,9],[18,10,19,10],[18,11,19,11],[18,12,19,12],[18,13,19,13],[18,14,19,14],[18,15,19,15],[19,4,19,5],[19,6,19,7],[19,8,19,9],[20,10,21,10],[20,11,21,11],[20,12,21,12],[20,13,21,13],[20,14,21,14],[20,15,21,15],[21,4,21,5],[21,6,21,7],[21,8,21,9],[22,10,23,10],[22,11,23,11],[22,12,23,12],[22,13,23,13],[22,14,23,14],[22,15,23,15],[23,4,23,5],[23,6,23,7],[23,8,23,9],[24,10,25,10],[24,11,25,11],[24,12,25,12],[24,13,25,13],[24,14,25,14],[24,15,25,15],[25,4,25,5],[25,6,25,7],[25,8,25,9],[26,10,27,10],[26,11,27,11],[26,12,27,12],[26,13,27,13],[26,14,27,14],[26,15,27,15],[27,4,27,5],[27,6,27,7],[27,8,27,9],[28,10,29,10],[28,11,29,11],[28,12,29,12],[28,13,29,13],[28,14,29,14],[28,15,29,15],[29,4,29,5],[29,6,29,7],[29,8,29,9],[30,10,31,10],[30,11,31,11],[30,12,31,12],[30,13,31,13],[30,14,31,14],[30,15,31,15],[31,4,31,5],[31,6,31,7],[31,8,31,9],[32,10,33,10],[32,11,33,11],[32,12,33,12],[32,13,33,13],[32,14,33,14],[32,15,33,15],[33,4,33,5],[33,6,33,7],[33,8,33,9],[34,10,35,10],[34,11,35,11],[34,12,35,12],[34,13,35,13],[34,14,35,14],[34,15,35,15],[35,4,35,5],[35,6,35,7],[35,8,35,9],[36,10,37,10],[36,11,37,11],[36,12,37,12],[36,13,37,13],[36,14,37,14],[36,15,37,15],[37,4,37,5],[37,6,37,7],[37,8,37,9],[38,10,39,10],[38,11,39,11],[38,12,39,12],[38,13,39,13],[38,14,39,14],[38,15,39,15],[39,4,39,5],[39,6,39,7],[39,8,39,9],[40,10,41,10],[40,11,41,11],[40,12,41,12],[40,13,41,13],[40,14,41,14],[40,15,41,15],[41,4,41,5],[41,6,41,7],[41,8,41,9],[42,10,43,10],[42,11,43,11],[42,12,43,12],[42,13,43,13],[42,14,43,14],[42,15,43,15],[43,4,43,5],[43,6,43,7],[43,8,43,9],[44,10,45,10],[44,11,45,11],[44,12,45,12],[44,13,45,13],[44,14,45,14],[44,15,45,15],[45,4,45,5],[45,6,45,7],[45,8,45,9],[46,10,47,10],[46,11,47,11],[46,12,47,12],[46,13,47,13],[46,14,47,14],[46,15,47,15],[47,4,47,5],[47,6,47,7],[47,8,47,9],[48,10,49,10],[48,11,49,11],[48,12,49,12],[48,13,49,13],[48,14,49,14],[48,15,49,15],[49,4,49,5],[49,6,49,7],[49,8,49,9],[50,10,51,10],[50,11,51,11],[50,12,51,12],[50,13,51,13],[50,14,51,14],[50,15,51,15],[51,4,51,5],[51,6,51,7],[51,8,51,9],[52,10,53,10],[52,11,53,11],[52,12,53,12],[52,13,53,13],[52,14,53,14],[52,15,53,15],[53,4,53,5],[53,6,53,7],[53,8,53,9],[54,10,55,10],[54,11,55,11],[54,12,55,12],[54,13,55,13],[54,14,55,14],[54,15,55,15],[55,4,55,5],[55,6,55,7],[55,8,55,9],[56,10,57,10],[56,11,57,11],[56,12,57,12],[56,13,57,13],[56,14,57,14],[56,15,57,15],[57,4,57,5],[57,6,57,7],[57,8,57,9],[58,10,59,10],[58,11,59,11],[58,12,59,12],[58,13,59,13],[58,14,59,14],[58,15,59,15],[59,4,59,5],[59,6,59,7],[59,8,59,9],[60,10,61,10],[60,11,61,11],[60,12,61,12],[60,13,61,13],[60,14,61,14],[60,15,61,15],[61,4,61,5],[61,6,61,7],[61,8,61,9],[62,10,63,10],[62,11,63,11],[62,12,63,12],[62,13,63,13],[62,14,63,14],[62,15,63,15],[63,4,63,5],[63,6,63,7],[63,8,63,9],[64,10,65,10],[64,11,65,11],[64,12,65,12],[64,13,65,13],[64,14,65,14],[64,15,65,15],[65,4,65,5],[65,6,65,7],[65,8,65,9],[66,10,67,10],[66,11,67,11],[66,12,67,12],[66,13,67,13],[66,14,67,14],[66,15,67,15],[67,4,67,5],[67,6,67,7],[67,8,67,9],[0,0,0,15],[1,0,1,15],[2,0,2,15],[3,0,3,15],[5,2,5,10],[6,2,6,10],[13,0,14,0],[13,1,14,3],[13,4,14,5],[13,6,13,7],[13,8,13,9],[13,10,13,15],[6,20,6,21],[7,9,7,12],[8,0,8,5],[8,9,8,14],[9,0,9,6],[11,1,11,3],[11,5,11,6],[13,20,14,20],[13,21,14,21],[14,6,14,7],[14,8,14,9],[14,10,14,15]]}
["绩能复合材料制品（广州）有限公司",null,null,null,null,null,null,null,null,null,null,null,null,null,null,null,"1、纸箱规格一定要检查是否需要修改？"]
["JI NENG COMPOSITE MATERIALS & PRODUCTS (GUANGZHOU) LTD.",null,null,null,null,null,null,null,null,null,null,null,null,null,null,null,"2、车叉需注意区分类型；"]
["728 Xiagang Blvd., Heng Yun Building 5F Guangzhou Economic & Technology Development District",null,null,null,null,null,null,null,null,null,null,null,null,null,null,null,"3、TFC一个卡板只能放八层，但一层可放5箱"]
["TEL:86-20-22321015 FAX: 86-757-82209433",null,null,null,null,null,null,null,null,null,null,null,null,null,null,null,"4、注意汇总重量数据是否包括全部？"]
[null,null,null,null,null,null,null,null,null,null,null,null,null,null,null,null,null,null,null,null,"考虑先进先出时："]
[null,null,"装箱单",null,null,null,null,null,null,null,null,null,null,null,null,null,null,null,null,null,"请注意库存数据截止时间如下:"]
[null,null,"PACKING LIST",null,null,null,null,null,null,null,null,null,null,null,null,null,null,null,null,null,{"$f":"NOW()","v":"2018-01-30T21:45:22.720"}]
["To Messrs:",null,null,null,null,null,null,null,"Invoice No.:","JEC-",null,null,null,null,null,null,null,null,null,null,"(灰色部分为库存数量暂不够部分)"]
["TRUE TEMPER SPORTS INC.",null,null,null,null,null,null,null,"Date:","2007-08-"]
["ADD: 1020 North Marshall Aven. El Cajon, CA 92020"]
[null,"UTEJMQL33WR-46",null,null,null,null,null,null,null,null,{"$f":"IF(TYPE(VLOOKUP(B:B,[1]重量与单价数据!A$1:I$65536,9,0))=16,\"\",VLOOKUP(B:B,[1]重量与单价数据!A$1:I$65536,9,0))","v":122},"x",{"$f":"IF(TYPE(VLOOKUP(B:B,[1]重量与单价数据!A$1:J$65536,10,0))=16,\"\",VLOOKUP(B:B,[1]重量与单价数据!A$1:J$65536,10,0))","v":15},"x",{"$f":"IF(TYPE(VLOOKUP(B:B,[1]重量与单价数据!A$1:K$65536,11,0))=16,\"\",VLOOKUP(B:B,[1]重量与单价数据!A$1:K$65536,11,0))","v":10},"cm",null,null,null,null,{"$f":"IF(TYPE(VLOOKUP(B:B,[1]制单!A$1:J$65536,10,0))=16,\"\",VLOOKUP(B:B,[1]制单!A$1:J$65536,10,0))","v":""},{"$f":"IF(TYPE(VLOOKUP(B:B,[1]出货计划Remark!A$1:L$65536,12,0))=16,\"\",VLOOKUP(B:B,[1]出货计划Remark!A$1:L$65536,12,0))","v":""}]
["From ","GUANGZHOU，CHINA",null,null,"To"]
[null,null,null,{"$f":"IF(TYPE(VLOOKUP(B:B,[1]制单!A$1:G$65536,7,0))=16,\"\",VLOOKUP(B:B,[1]制单!A$1:G$65536,7,0))","v":""},null,null,null,null,null,null,null,null,null,null,null,null,null,null,null,null,{"$f":"IF(TYPE(VLOOKUP(B:B,[1]制单!A$1:K$65536,11,0))=16,\"\",IF(VLOOKUP(B:B,[1]制单!A$1:K$65536,11,0)>=0,\"\",VLOOKUP(B:B,[1]制单!A$1:K$65536,11,0)))","v":""}]
["CTN\n NO.","DESCRIPTION OF GOODS ",null,null,"QUANTITY",null,"GROSS WEIGHT",null,"NET WEIGHT",null,"MEASUREMENT",null,null,null,null,null,"体积","每支单重","纸箱重量","每箱数量","Inventory\nQTY","Remark"]
[null,null,null,null,null,null,"(KGS)",null,"(KGS)",null,"(cm)",null,null,null,null,null,null,null,null,null,{"$f":"IF(TYPE(VLOOKUP(B:B,[1]制单!A$1:K$65536,11,0))=16,\"\",IF(VLOOKUP(B:B,[1]制单!A$1:K$65536,11,0)>=0,\"\",VLOOKUP(B:B,[1]制单!A$1:K$65536,11,0)))","v":""}]
[null,"高尔夫球杆杆轴11",null,"( 1355PCS )",null,null,null,null,null,null,null,null,null,null,null,null,null,null,null,null,{"$f":"IF(TYPE(VLOOKUP(B:B,[1]制单!A$1:K$65536,11,0))=16,\"\",IF(VLOOKUP(B:B,[1]制单!A$1:K$65536,11,0)>=0,\"\",VLOOKUP(B:B,[1]制单!A$1:K$65536,11,0)))","v":""}]
["1 - 5",{"$f":"INVOICE!B19","v":"BAL-SQRB-11052"},null,null,5,"CARTONS",88.9,"KGS",81.5,"KGS",{"$f":"VLOOKUP(B:B,重量与单价数据!A:I,9,0)","v":145},"x",{"$f":"VLOOKUP(B:B,重量与单价数据!A:J,10,0)","v":29},"x",{"$f":"VLOOKUP(B:B,重量与单价数据!A:K,11,0)","v":16},"cm",{"$f":"E17*K17*M17*O17/1000000","v":0.33639999999999998},{"$f":"VLOOKUP(B:B,重量与单价数据!A:C,3,0)/1000","v":0.32600000000000001},{"$f":"VLOOKUP(B:B,重量与单价数据!A:E,5,0)","v":1.48},{"$f":"VLOOKUP(B:B,重量与单价数据!A:D,4,0)","v":50}]
[null,null,null,null,"( 50 PCS/CTN, 250PCS)",null,"(@17.78 kgs)",null,"(@16.3kgs)"]
["6 - 6",{"$f":"B17","v":"BAL-SQRB-11052"},null,null,1,"CARTONS",16.149999999999999,"KGS",14.67,"KGS",{"$f":"VLOOKUP(B:B,重量与单价数据!A:I,9,0)","v":145},"x",{"$f":"VLOOKUP(B:B,重量与单价数据!A:J,10,0)","v":29},"x",{"$f":"VLOOKUP(B:B,重量与单价数据!A:K,11,0)","v":16},"cm",{"$f":"E19*K19*M19*O19/1000000","v":6.7280000000000006E-2},{"$f":"VLOOKUP(B:B,重量与单价数据!A:C,3,0)/1000","v":0.32600000000000001}]
[null,null,null,null,"( 45 PCS/CTN, 45PCS)",null,"(@16.15 kgs)",null,"(@14.67kgs)"]
["7 - 42",{"$f":"INVOICE!B21","v":"TAQ-1125-ST-CB-70041"},null,null,36,"CARTONS",33.479999999999997,"KGS",15.48,"KGS",{"$f":"VLOOKUP(B:B,重量与单价数据!A:I,9,0)","v":89},"x",{"$f":"VLOOKUP(B:B,重量与单价数据!A:J,10,0)","v":14},"x",{"$f":"VLOOKUP(B:B,重量与单价数据!A:K,11,0)","v":9},"cm",{"$f":"E21*K21*M21*O21/1000000","v":0.40370400000000001},{"$f":"VLOOKUP(B:B,重量与单价数据!A:C,3,0)/1000","v":0.43},{"$f":"VLOOKUP(B:B,重量与单价数据!A:E,5,0)","v":0.5},{"$f":"VLOOKUP(B:B,重量与单价数据!A:D,4,0)","v":1}]
[null,null,null,null,"( 1 PCS/CTN, 36PCS)",null,"(@.93 kgs)",null,"(@.43kgs)"]
["43 - 46",{"$f":"INVOICE!B23","v":"ULAUNCH145TS-46"},null,null,4,"CARTONS",22.2,"KGS",19.8,"KGS",{"$f":"VLOOKUP(B:B,重量与单价数据!A:I,9,0)","v":122},"x",{"$f":"VLOOKUP(B:B,重量与单价数据!A:J,10,0)","v":15},"x",{"$f":"VLOOKUP(B:B,重量与单价数据!A:K,11,0)","v":10},"cm",{"$f":"E23*K23*M23*O23/1000000","v":7.3200000000000001E-2},{"$f":"VLOOKUP(B:B,重量与单价数据!A:C,3,0)/1000","v":9.9000000000000005E-2},{"$f":"VLOOKUP(B:B,重量与单价数据!A:E,5,0)","v":0.6},{"$f":"VLOOKUP(B:B,重量与单价数据!A:D,4,0)","v":50}]
[null,null,null,null,"( 50 PCS/CTN, 200PCS)",null,"(@5.55 kgs)",null,"(@4.95kgs)"]
["47 - 47",{"$f":"B23","v":"ULAUNCH145TS-46"},null,null,1,"CARTONS",3.9660000000000002,"KGS",3.3660000000000001,"KGS",{"$f":"VLOOKUP(B:B,重量与单价数据!A:I,9,0)","v":122},"x",{"$f":"VLOOKUP(B:B,重量与单价数据!A:J,10,0)","v":15},"x",{"$f":"VLOOKUP(B:B,重量与单价数据!A:K,11,0)","v":10},"cm",{"$f":"E25*K25*M25*O25/1000000","v":1.83E-2},{"$f":"VLOOKUP(B:B,重量与单价数据!A:C,3,0)/1000","v":9.9000000000000005E-2}]
[null,null,null,null,"( 34 PCS/CTN, 34PCS)",null,"(@3.966 kgs)",null,"(@3.366kgs)"]
["48 - 48",{"$f":"INVOICE!B25","v":"GSAL355IS-40-T"},null,null,1,"CARTONS",1.8959999999999999,"KGS",1.2959999999999998,"KGS",{"$f":"VLOOKUP(B:B,重量与单价数据!A:I,9,0)","v":122},"x",{"$f":"VLOOKUP(B:B,重量与单价数据!A:J,10,0)","v":15},"x",{"$f":"VLOOKUP(B:B,重量与单价数据!A:K,11,0)","v":10},"cm",{"$f":"E27*K27*M27*O27/1000000","v":1.83E-2},{"$f":"VLOOKUP(B:B,重量与单价数据!A:C,3,0)/1000","v":7.1999999999999995E-2},{"$f":"VLOOKUP(B:B,重量与单价数据!A:E,5,0)","v":0.6},{"$f":"VLOOKUP(B:B,重量与单价数据!A:D,4,0)","v":50}]
[null,null,null,null,"( 18 PCS/CTN, 18PCS)",null,"(@1.896 kgs)",null,"(@1.296kgs)"]
["49 - 98",{"$f":"INVOICE!B27","v":"TAQEX-1125-ST-CB-70044"},null,null,50,"CARTONS",46.5,"KGS",21.5,"KGS",{"$f":"VLOOKUP(B:B,重量与单价数据!A:I,9,0)","v":89},"x",{"$f":"VLOOKUP(B:B,重量与单价数据!A:J,10,0)","v":14},"x",{"$f":"VLOOKUP(B:B,重量与单价数据!A:K,11,0)","v":9},"cm",{"$f":"E29*K29*M29*O29/1000000","v":0.56069999999999998},{"$f":"VLOOKUP(B:B,重量与单价数据!A:C,3,0)/1000","v":0.43},{"$f":"VLOOKUP(B:B,重量与单价数据!A:E,5,0)","v":0.5},{"$f":"VLOOKUP(B:B,重量与单价数据!A:D,4,0)","v":1}]
[null,null,null,null,"( 1 PCS/CTN, 50PCS)",null,"(@.93 kgs)",null,"(@.43kgs)"]
{"$rows_left_out":50}
{"sheet":"重量与单价数据","index":3,"n_rows":1492,"n_cols":15,"rows_kept":1492,"cut":false,"hidden":false,"merged":[]}
["SKU","Price","Item weight(gross)","packed qty","gross weight","company sp","type","carton size","carton(length)","carton(width)","carton(height)","engineer data","on-hand QTY","estimated weight","Weight weighed"]
["AUCRULRLSIL-38",9,74,50,0.6,1,"golf","122*15*10",122,15,10,{"$error":"#N/A"},12,"Y"]
["AUCRULRLSIM-40",9,74,50,0.6,2,"golf","122*15*10",122,15,10,{"$error":"#N/A"},24,"Y"]
["AUCRULRLSWL-44",9,74,50,0.6,3,"golf","122*15*10",122,15,10,{"$error":"#N/A"},3,"Y"]
["AUPL-76-WA-46",9,65,50,0.6,4,"golf","122*15*10",122,15,10,"59-65",0]
["AUPL-76-WS-46",9,70,50,0.6,5,"golf","122*15*10",122,15,10,"64－70",0]
["I19A-55PA-03600",9,71,50,0.6,6,"golf","122*15*10",122,15,10,"67-71",0]
["I19A-55PR-03600",9,73,50,0.6,7,"golf","122*15*10",122,15,10,"69-73",0]
["I19A-55PS-03600",9,75,50,0.6,8,"golf","122*15*10",122,15,10,"71-75",0]
["I19A-60PA-03600",9,71,50,0.6,9,"golf","122*15*10",122,15,10,"67-71",0]
["I19A-60PR-03600",9,73,50,0.6,10,"golf","122*15*10",122,15,10,"69-73",0]
["I19A-60PS-03600",9,75,50,0.6,11,"golf","122*15*10",122,15,10,"71-75",0]
["I19A-65PA-03600",9,71,50,0.6,12,"golf","122*15*10",122,15,10,"67-71",0]
["I19A-65PR-03600",9,73,50,0.6,13,"golf","122*15*10",122,15,10,"69-73",0]
["I19A-65PS-03600",9,75,50,0.6,14,"golf","122*15*10",122,15,10,"71-75",0]
["I19A-70PA-03600",9,71,50,0.6,15,"golf","122*15*10",122,15,10,"67-71",0]
["I19A-70PR-03600",9,73,50,0.6,16,"golf","122*15*10",122,15,10,"69-73",0]
["I19A-70PS-03600",9,75,50,0.6,17,"golf","122*15*10",122,15,10,"71-75",0]
["I19A-75PA-03600",9,71,50,0.6,18,"golf","122*15*10",122,15,10,"67-71",0]
["I19A-75PR-03600",9,73,50,0.6,19,"golf","122*15*10",122,15,10,"69-73",0]
["I19A-75PS-03600",9,75,50,0.6,20,"golf","122*15*10",122,15,10,"71-75",0]
["I19A-80PA-03600",9,71,50,0.6,21,"golf","122*15*10",122,15,10,"67-71",0]
["I19A-80PR-03600",9,73,50,0.6,22,"golf","122*15*10",122,15,10,"69-73",0]
["I19A-80PS-03600",9,75,50,0.6,23,"golf","122*15*10",122,15,10,"71-75",0]
["I19A-85PA-03600",9,71,50,0.6,24,"golf","122*15*10",122,15,10,"67-71",0]
["I19A-85PR-03600",9,73,50,0.6,25,"golf","122*15*10",122,15,10,"69-73",0]
["I19A-85PS-03600",9,75,50,0.6,26,"golf","122*15*10",122,15,10,"71-75",0]
["I19A-90PA-03600",9,71,50,0.6,27,"golf","122*15*10",122,15,10,"67-71",0]
["I19A-90PR-03600",9,73,50,0.6,28,"golf","122*15*10",122,15,10,"69-73",0]
["I19A-90PS-03600",9,75,50,0.6,29,"golf","122*15*10",122,15,10,"71-75",0]
{"$rows_left_out":1462}