{"text_format":"1","workbook":"xlsx","n_sheets":4,"sheets":["制单","INVOICE","PACKING LIST","重量与单价数据"],"not_rendered":{"charts":0,"images":0,"macros":1,"external_links":2,"defined_names":0,"comments":1,"pivot_tables":0},"unopened":[],"bounds":{"document_bytes":16777216,"sheet_cells":100000,"rows_first":2000,"rows_last":500,"rows_between":2000,"halvings":0,"cell_chars":16384,"cell_head_chars":4096},"cells_cut":0,"cells_raw":0,"read":"whole","date_system":"1900"}

{"sheet":"制单","index":0,"n_rows":21,"n_cols":17,"rows_kept":21,"cut":false,"hidden":false,"merged":[[0,1,0,6],[0,9,0,10]]}
[null,null,null,null,null,null,null,null,"备货日期：",{"$f":"NOW()","v":"2018-01-30T21:45:22.720"},null,null,null,null,null,18,"1、确认《shipping schedule》对包装\\标签等的特殊要求，包括Packing Instruction和Remarks；如PING客户必须有PO号及出货日期的标签；ORGA要求有ORGA ITEM CODE,以及良品或不良，P、N以及真假杆的情形；"]
["Product  SKU","company\nsp","SKU Desc","Order Qty","Finish Products in warehouse","(23-Jun)Plan Qty","Actually \nShip Qty","unit\nweight","CTN\nWEIGHT","on-hand\n QTY","Insufficient\nQTY","category","remak1+不良+分类","CTN","ODD","SIZE","2、将《shipping schedule》中的计划复制到此表，然后做《数据透视表》；"]
["产品品名","代码","包装量","定单数","入库的成品数","6月23日的计划出货数","实际出货数","单重（g）","箱重","现有库存","不够数量","类别","备注","箱数","零头","纸箱类型","3、将《数据透视表》数据复制到《制单》，按成品大类排序，然后考虑按数量排序（因数量少的需合并）；"]
["BAL-SQRB-11052",{"$f":"VLOOKUP(A:A,[1]重量与单价数据!A$1:F$65536,6,0)","v":385},{"$f":"VLOOKUP(A:A,[1]重量与单价数据!A$1:G$65536,4,0)","v":50},null,null,null,295,{"$f":"VLOOKUP(A:A,[1]重量与单价数据!A$1:C$65536,3,0)","v":326},{"$f":"VLOOKUP(A:A,[1]重量与单价数据!A$1:E$65536,5,0)","v":1.48},null,{"$f":"J4-G4","v":-295},{"$f":"VLOOKUP(A:A,[1]重量与单价数据!A$1:G$65536,7,0)","v":"Shaft"},{"$f":"VLOOKUP(A:A,重量与单价数据!A$1:P$65536,16,0)","v":0},{"$f":"CEILING(G4/C4,1)","v":6},{"$f":"G4-FLOOR(G4,C4)","v":45},{"$f":"VLOOKUP(A:A,重量与单价数据!A$1:H$65536,8,0)","v":"145*29*16"}]
["TAQ-1125-ST-CB-70041",{"$f":"VLOOKUP(A:A,[1]重量与单价数据!A$1:F$65536,6,0)","v":386},{"$f":"VLOOKUP(A:A,[1]重量与单价数据!A$1:G$65536,4,0)","v":1},null,null,null,36,{"$f":"VLOOKUP(A:A,[1]重量与单价数据!A$1:C$65536,3,0)","v":430},{"$f":"VLOOKUP(A:A,[1]重量与单价数据!A$1:E$65536,5,0)","v":0.5},null,{"$f":"J5-G5","v":-36},{"$f":"VLOOKUP(A:A,[1]重量与单价数据!A$1:G$65536,7,0)","v":"fork"},{"$f":"VLOOKUP(A:A,重量与单价数据!A$1:P$65536,16,0)","v":0},{"$f":"CEILING(G5/C5,1)","v":36},{"$f":"G5-FLOOR(G5,C5)","v":0},{"$f":"VLOOKUP(A:A,重量与单价数据!A$1:H$65536,8,0)","v":"89*14*9"}]
["ULAUNCH145TS-46",{"$f":"VLOOKUP(A:A,[1]重量与单价数据!A$1:F$65536,6,0)","v":340},{"$f":"VLOOKUP(A:A,[1]重量与单价数据!A$1:G$65536,4,0)","v":50},null,null,null,234,{"$f":"VLOOKUP(A:A,[1]重量与单价数据!A$1:C$65536,3,0)","v":99},{"$f":"VLOOKUP(A:A,[1]重量与单价数据!A$1:E$65536,5,0)","v":0.6},null,-234,{"$f":"VLOOKUP(A:A,[1]重量与单价数据!A$1:G$65536,7,0)","v":"golf"},{"$f":"VLOOKUP(A:A,重量与单价数据!A$1:P$65536,16,0)","v":0},5,34,{"$f":"VLOOKUP(A:A,重量与单价数据!A$1:H$65536,8,0)","v":"122*15*10"}]
["GSAL355IS-40-T",{"$f":"VLOOKUP(A:A,[1]重量与单价数据!A$1:F$65536,6,0)","v":765},{"$f":"VLOOKUP(A:A,[1]重量与单价数据!A$1:G$65536,4,0)","v":50},null,null,null,18,{"$f":"VLOOKUP(A:A,[1]重量与单价数据!A$1:C$65536,3,0)","v":72},{"$f":"VLOOKUP(A:A,[1]重量与单价数据!A$1:E$65536,5,0)","v":0.6},null,{"$f":"J7-G7","v":-18},{"$f":"VLOOKUP(A:A,[1]重量与单价数据!A$1:G$65536,7,0)","v":"golf"},{"$f":"VLOOKUP(A:A,重量与单价数据!A$1:P$65536,16,0)","v":0},{"$f":"CEILING(G7/C7,1)","v":1},{"$f":"G7-FLOOR(G7,C7)","v":18},{"$f":"VLOOKUP(A:A,重量与单价数据!A$1:H$65536,8,0)","v":"122*15*10"}]
["TAQEX-1125-ST-CB-70044",{"$f":"VLOOKUP(A:A,[1]重量与单价数据!A$1:F$65536,6,0)","v":339},{"$f":"VLOOKUP(A:A,[1]重量与单价数据!A$1:G$65536,4,0)","v":1},null,null,null,50,{"$f":"VLOOKUP(A:A,[1]重量与单价数据!A$1:C$65536,3,0)","v":430},{"$f":"VLOOKUP(A:A,[1]重量与单价数据!A$1:E$65536,5,0)","v":0.5},null,-50,{"$f":"VLOOKUP(A:A,[1]重量与单价数据!A$1:G$65536,7,0)","v":"fork"},{"$f":"VLOOKUP(A:A,重量与单价数据!A$1:P$65536,16,0)","v":0},50,0,{"$f":"VLOOKUP(A:A,重量与单价数据!A$1:H$65536,8,0)","v":"89*14*9"}]
["ULAUNCH145TS-46",{"$f":"VLOOKUP(A:A,[1]重量与单价数据!A$1:F$65536,6,0)","v":340},{"$f":"VLOOKUP(A:A,[1]重量与单价数据!A$1:G$65536,4,0)","v":50},null,null,null,234,{"$f":"VLOOKUP(A:A,[1]重量与单价数据!A$1:C$65536,3,0)","v":99},{"$f":"VLOOKUP(A:A,[1]重量与单价数据!A$1:E$65536,5,0)","v":0.6},null,-234,{"$f":"VLOOKUP(A:A,[1]重量与单价数据!A$1:G$65536,7,0)","v":"golf"},{"$f":"VLOOKUP(A:A,重量与单价数据!A$1:P$65536,16,0)","v":0},5,34,{"$f":"VLOOKUP(A:A,重量与单价数据!A$1:H$65536,8,0)","v":"122*15*10"}]
["GSAL355IS-40-T",{"$f":"VLOOKUP(A:A,[1]重量与单价数据!A$1:F$65536,6,0)","v":765},{"$f":"VLOOKUP(A:A,[1]重量与单价数据!A$1:G$65536,4,0)","v":50},null,null,null,18,{"$f":"VLOOKUP(A:A,[1]重量与单价数据!A$1:C$65536,3,0)","v":72},{"$f":"VLOOKUP(A:A,[1]重量与单价数据!A$1:E$65536,5,0)","v":0.6},null,-18,{"$f":"VLOOKUP(A:A,[1]重量与单价数据!A$1:G$65536,7,0)","v":"golf"},{"$f":"VLOOKUP(A:A,重量与单价数据!A$1:P$65536,16,0)","v":0},1,18,{"$f":"VLOOKUP(A:A,重量与单价数据!A$1:H$65536,8,0)","v":"122*15*10"}]
["CCM-V8-TT-4556",{"$f":"VLOOKUP(A:A,[1]重量与单价数据!A$1:F$65536,6,0)","v":766},{"$f":"VLOOKUP(A:A,[1]重量与单价数据!A$1:G$65536,4,0)","v":50},null,null,null,25,{"$f":"VLOOKUP(A:A,[1]重量与单价数据!A$1:C$65536,3,0)","v":380},{"$f":"VLOOKUP(A:A,[1]重量与单价数据!A$1:E$65536,5,0)","v":1.48},null,-25,{"$f":"VLOOKUP(A:A,[1]重量与单价数据!A$1:G$65536,7,0)","v":"shaft"},{"$f":"VLOOKUP(A:A,重量与单价数据!A$1:P$65536,16,0)","v":0},1,25,{"$f":"VLOOKUP(A:A,重量与单价数据!A$1:H$65536,8,0)","v":"145*29*16"}]
["SHR-RM19-P225-G01L-57",{"$f":"VLOOKUP(A:A,[1]重量与单价数据!A$1:F$65536,6,0)","v":1496},{"$f":"VLOOKUP(A:A,[1]重量与单价数据!A$1:G$65536,4,0)","v":12},null,null,null,25,{"$f":"VLOOKUP(A:A,[1]重量与单价数据!A$1:C$65536,3,0)","v":740},{"$f":"VLOOKUP(A:A,[1]重量与单价数据!A$1:E$65536,5,0)","v":2.2200000000000002},null,{"$f":"J12-G12","v":-25},{"$f":"VLOOKUP(A:A,[1]重量与单价数据!A$1:G$65536,7,0)","v":"goalier"},{"$f":"VLOOKUP(A:A,重量与单价数据!A$1:P$65536,16,0)","v":0},{"$f":"CEILING(G12/C12,1)","v":3},{"$f":"G12-FLOOR(G12,C12)","v":1},{"$f":"VLOOKUP(A:A,重量与单价数据!A$1:H$65536,8,0)","v":"179*42*15"}]
["SHR-RM19-P225-G01L-57",{"$f":"VLOOKUP(A:A,[1]重量与单价数据!A$1:F$65536,6,0)","v":1496},{"$f":"VLOOKUP(A:A,[1]重量与单价数据!A$1:G$65536,4,0)","v":12},null,null,null,25,{"$f":"VLOOKUP(A:A,[1]重量与单价数据!A$1:C$65536,3,0)","v":740},{"$f":"VLOOKUP(A:A,[1]重量与单价数据!A$1:E$65536,5,0)","v":2.2200000000000002},null,{"$f":"J13-G13","v":-25},{"$f":"VLOOKUP(A:A,[1]重量与单价数据!A$1:G$65536,7,0)","v":"goalier"},{"$f":"VLOOKUP(A:A,重量与单价数据!A$1:P$65536,16,0)","v":0},{"$f":"CEILING(G13/C13,1)","v":3},{"$f":"G13-FLOOR(G13,C13)","v":1},{"$f":"VLOOKUP(A:A,重量与单价数据!A$1:H$65536,8,0)","v":"179*42*15"}]
["GSAL355IS-40-T",{"$f":"VLOOKUP(A:A,[1]重量与单价数据!A$1:F$65536,6,0)","v":765},{"$f":"VLOOKUP(A:A,[1]重量与单价数据!A$1:G$65536,4,0)","v":50},null,null,null,18,{"$f":"VLOOKUP(A:A,[1]重量与单价数据!A$1:C$65536,3,0)","v":72},{"$f":"VLOOKUP(A:A,[1]重量与单价数据!A$1:E$65536,5,0)","v":0.6},null,-18,{"$f":"VLOOKUP(A:A,[1]重量与单价数据!A$1:G$65536,7,0)","v":"golf"},{"$f":"VLOOKUP(A:A,重量与单价数据!A$1:P$65536,16,0)","v":0},1,18,{"$f":"VLOOKUP(A:A,重量与单价数据!A$1:H$65536,8,0)","v":"122*15*10"}]
["TAQEX-1125-ST-CB-70044",{"$f":"VLOOKUP(A:A,[1]重量与单价数据!A$1:F$65536,6,0)","v":339},{"$f":"VLOOKUP(A:A,[1]重量与单价数据!A$1:G$65536,4,0)","v":1},null,null,null,50,{"$f":"VLOOKUP(A:A,[1]重量与单价数据!A$1:C$65536,3,0)","v":430},{"$f":"VLOOKUP(A:A,[1]重量与单价数据!A$1:E$65536,5,0)","v":0.5},null,-50,{"$f":"VLOOKUP(A:A,[1]重量与单价数据!A$1:G$65536,7,0)","v":"fork"},{"$f":"VLOOKUP(A:A,重量与单价数据!A$1:P$65536,16,0)","v":0},50,0,{"$f":"VLOOKUP(A:A,重量与单价数据!A$1:H$65536,8,0)","v":"89*14*9"}]
["ULAUNCH145TS-46",{"$f":"VLOOKUP(A:A,[1]重量与单价数据!A$1:F$65536,6,0)","v":340},{"$f":"VLOOKUP(A:A,[1]重量与单价数据!A$1:G$65536,4,0)","v":50},null,null,null,234,{"$f":"VLOOKUP(A:A,[1]重量与单价数据!A$1:C$65536,3,0)","v":99},{"$f":"VLOOKUP(A:A,[1]重量与单价数据!A$1:E$65536,5,0)","v":0.6},null,-234,{"$f":"VLOOKUP(A:A,[1]重量与单价数据!A$1:G$65536,7,0)","v":"golf"},{"$f":"VLOOKUP(A:A,重量与单价数据!A$1:P$65536,16,0)","v":0},5,34,{"$f":"VLOOKUP(A:A,重量与单价数据!A$1:H$65536,8,0)","v":"122*15*10"}]
["GSAL355IS-40-T",{"$f":"VLOOKUP(A:A,[1]重量与单价数据!A$1:F$65536,6,0)","v":765},{"$f":"VLOOKUP(A:A,[1]重量与单价数据!A$1:G$65536,4,0)","v":50},null,null,null,18,{"$f":"VLOOKUP(A:A,[1]重量与单价数据!A$1:C$65536,3,0)","v":72},{"$f":"VLOOKUP(A:A,[1]重量与单价数据!A$1:E$65536,5,0)","v":0.6},null,-18,{"$f":"VLOOKUP(A:A,[1]重量与单价数据!A$1:G$65536,7,0)","v":"golf"},{"$f":"VLOOKUP(A:A,重量与单价数据!A$1:P$65536,16,0)","v":0},1,18,{"$f":"VLOOKUP(A:A,重量与单价数据!A$1:H$65536,8,0)","v":"122*15*10"}]
["CCM-V8-TT-4556",{"$f":"VLOOKUP(A:A,[1]重量与单价数据!A$1:F$65536,6,0)","v":766},{"$f":"VLOOKUP(A:A,[1]重量与单价数据!A$1:G$65536,4,0)","v":50},null,null,null,25,{"$f":"VLOOKUP(A:A,[1]重量与单价数据!A$1:C$65536,3,0)","v":380},{"$f":"VLOOKUP(A:A,[1]重量与单价数据!A$1:E$65536,5,0)","v":1.48},null,-25,{"$f":"VLOOKUP(A:A,[1]重量与单价数据!A$1:G$65536,7,0)","v":"shaft"},{"$f":"VLOOKUP(A:A,重量与单价数据!A$1:P$65536,16,0)","v":0},1,25,{"$f":"VLOOKUP(A:A,重量与单价数据!A$1:H$65536,8,0)","v":"145*29*16"}]
["SHR-RM19-P225-G01L-57",{"$f":"VLOOKUP(A:A,[1]重量与单价数据!A$1:F$65536,6,0)","v":1496},{"$f":"VLOOKUP(A:A,[1]重量与单价数据!A$1:G$65536,4,0)","v":12},null,null,null,25,{"$f":"VLOOKUP(A:A,[1]重量与单价数据!A$1:C$65536,3,0)","v":740},{"$f":"VLOOKUP(A:A,[1]重量与单价数据!A$1:E$65536,5,0)","v":2.2200000000000002},null,{"$f":"J19-G19","v":-25},{"$f":"VLOOKUP(A:A,[1]重量与单价数据!A$1:G$65536,7,0)","v":"goalier"},{"$f":"VLOOKUP(A:A,重量与单价数据!A$1:P$65536,16,0)","v":0},{"$f":"CEILING(G19/C19,1)","v":3},{"$f":"G19-FLOOR(G19,C19)","v":1},{"$f":"VLOOKUP(A:A,重量与单价数据!A$1:H$65536,8,0)","v":"179*42*15"}]
["SHR-RM19-P225-G01L-57",{"$f":"VLOOKUP(A:A,[1]重量与单价数据!A$1:F$65536,6,0)","v":1496},{"$f":"VLOOKUP(A:A,[1]重量与单价数据!A$1:G$65536,4,0)","v":12},null,null,null,25,{"$f":"VLOOKUP(A:A,[1]重量与单价数据!A$1:C$65536,3,0)","v":740},{"$f":"VLOOKUP(A:A,[1]重量与单价数据!A$1:E$65536,5,0)","v":2.2200000000000002},null,{"$f":"J20-G20","v":-25},{"$f":"VLOOKUP(A:A,[1]重量与单价数据!A$1:G$65536,7,0)","v":"goalier"},{"$f":"VLOOKUP(A:A,重量与单价数据!A$1:P$65536,16,0)","v":0},{"$f":"CEILING(G20/C20,1)","v":3},{"$f":"G20-FLOOR(G20,C20)","v":1},{"$f":"VLOOKUP(A:A,重量与单价数据!A$1:H$65536,8,0)","v":"179*42*15"}]
["Total",null,null,null,null,null,{"$f":"SUM(G$1:G20)","v":1355},null,null,null,null,null,null,{"$f":"SUM(N$1:N20)","v":175}]

{"sheet":"INVOICE","index":1,"n_rows":55,"n_cols":11,"rows_kept":55,"cut":false,"hidden":false,"merged":[[6,0,6,9],[0,0,0,9],[1,0,1,9],[2,0,2,9],[3,0,3,9],[5,0,5,9],[9,0,9,4],[12,0,12,3],[13,1,13,2],[13,4,13,7],[16,1,16,3],[16,4,16,5],[16,6,16,9]]}
["绩能复合材料制品（广州）有限公司"]
["JI NENG COMPOSITE MATERIALS & PRODUCTS (GUANGZHOU) LTD."]
["728 Xiagang Blvd., Heng Yun Building 5F Guangzhou Economic & Technology Development District"]
["TEL:86-20-22321015 FAX: 86-757-82209433"]
[]
["发票"]
["COMMERCIAL  INVOICE"]
[null,null,null,null,null,null,null,"Invoice No.:","JEC-05??"]
["To Messrs:",null,null,null,null,null,null,"Date:","2005-05-11"]
["TRUE TEMPER SPORTS INC."]
["                   ADD: 1020 North Marshall Aven. El Cajon, CA 92020",null,null,null,null,null,null,null,25]
[]
[]
["From ","GUANGZHOU,CHINA",null,"To","Hong Kong"]
[]
[]
["Marks & No.","Description Of Goods",null,null,"Unit Price",null,"Amount "]
[null,null,null,null,null,"CNF LOSANGELES"]
[null,"BAL-SQRB-11052",null,295,"PCS",{"$f":"VLOOKUP(B:B,重量与单价数据!A:B,2,0)","v":9},null,{"$f":"D19*F19","v":2655},null,null,{"$f":"VLOOKUP(B:B,重量与单价数据!A:D,4,0)","v":50}]
[]
[null,"TAQ-1125-ST-CB-70041",null,36,"PCS",{"$f":"VLOOKUP(B:B,重量与单价数据!A:B,2,0)","v":9},null,{"$f":"D21*F21","v":324},null,null,{"$f":"VLOOKUP(B:B,重量与单价数据!A:D,4,0)","v":1}]
[]
[null,"ULAUNCH145TS-46",null,234,"PCS",{"$f":"VLOOKUP(B:B,重量与单价数据!A:B,2,0)","v":9},null,{"$f":"D23*F23","v":2106},null,null,{"$f":"VLOOKUP(B:B,重量与单价数据!A:D,4,0)","v":50}]
[]
[null,"GSAL355IS-40-T",null,18,"PCS",{"$f":"VLOOKUP(B:B,重量与单价数据!A:B,2,0)","v":9},null,{"$f":"D25*F25","v":162},null,null,{"$f":"VLOOKUP(B:B,重量与单价数据!A:D,4,0)","v":50}]
[]
[null,"TAQEX-1125-ST-CB-70044",null,50,"PCS",{"$f":"VLOOKUP(B:B,重量与单价数据!A:B,2,0)","v":9},null,{"$f":"D27*F27","v":450},null,null,{"$f":"VLOOKUP(B:B,重量与单价数据!A:D,4,0)","v":1}]
[]
[null,"ULAUNCH145TS-46",null,234,"PCS",{"$f":"VLOOKUP(B:B,重量与单价数据!A:B,2,0)","v":9},null,{"$f":"D29*F29","v":2106},null,null,{"$f":"VLOOKUP(B:B,重量与单价数据!A:D,4,0)","v":50}]
[]
[null,"GSAL355IS-40-T",null,18,"PCS",{"$f":"VLOOKUP(B:B,重量与单价数据!A:B,2,0)","v":9},null,{"$f":"D31*F31","v":162},null,null,{"$f":"VLOOKUP(B:B,重量与单价数据!A:D,4,0)","v":50}]
[]
[null,"CCM-V8-TT-4556",null,25,"PCS",{"$f":"VLOOKUP(B:B,重量与单价数据!A:B,2,0)","v":9},null,{"$f":"D33*F33","v":225},null,null,{"$f":"VLOOKUP(B:B,重量与单价数据!A:D,4,0)","v":50}]
[]
[null,"SHR-RM19-P225-G01L-57",null,25,"PCS",{"$f":"VLOOKUP(B:B,重量与单价数据!A:B,2,0)","v":9},null,{"$f":"D35*F35","v":225},null,null,{"$f":"VLOOKUP(B:B,重量与单价数据!A:D,4,0)","v":12}]
[]
[null,"SHR-RM19-P225-G01L-57",null,25,"PCS",{"$f":"VLOOKUP(B:B,重量与单价数据!A:B,2,0)","v":9},null,{"$f":"D37*F37","v":225},null,null,{"$f":"VLOOKUP(B:B,重量与单价数据!A:D,4,0)","v":12}]
[]
[null,"GSAL355IS-40-T",null,18,"PCS",{"$f":"VLOOKUP(B:B,重量与单价数据!A:B,2,0)","v":9},null,{"$f":"D39*F39","v":162},null,null,{"$f":"VLOOKUP(B:B,重量与单价数据!A:D,4,0)","v":50}]
[]
[null,"TAQEX-1125-ST-CB-70044",null,50,"PCS",{"$f":"VLOOKUP(B:B,重量与单价数据!A:B,2,0)","v":9},null,{"$f":"D41*F41","v":450},null,null,{"$f":"VLOOKUP(B:B,重量与单价数据!A:D,4,0)","v":1}]
[]
[null,"ULAUNCH145TS-46",null,234,"PCS",{"$f":"VLOOKUP(B:B,重量与单价数据!A:B,2,0)","v":9},null,{"$f":"D43*F43","v":2106},null,null,{"$f":"VLOOKUP(B:B,重量与单价数据!A:D,4,0)","v":50}]
[]
[null,"GSAL355IS-40-T",null,18,"PCS",{"$f":"VLOOKUP(B:B,重量与单价数据!A:B,2,0)","v":9},null,{"$f":"D45*F45","v":162},null,null,{"$f":"VLOOKUP(B:B,重量与单价数据!A:D,4,0)","v":50}]
[]
[null,"CCM-V8-TT-4556",null,25,"PCS",{"$f":"VLOOKUP(B:B,重量与单价数据!A:B,2,0)","v":9},null,{"$f":"D47*F47","v":225},null,null,{"$f":"VLOOKUP(B:B,重量与单价数据!A:D,4,0)","v":50}]
[]
[null,"SHR-RM19-P225-G01L-57",null,25,"PCS",{"$f":"VLOOKUP(B:B,重量与单价数据!A:B,2,0)","v":9},null,{"$f":"D49*F49","v":225},null,null,{"$f":"VLOOKUP(B:B,重量与单价数据!A:D,4,0)","v":12}]
[]
[null,"SHR-RM19-P225-G01L-57",null,25,"PCS",{"$f":"VLOOKUP(B:B,重量与单价数据!A:B,2,0)","v":9},null,{"$f":"D51*F51","v":225},null,null,{"$f":"VLOOKUP(B:B,重量与单价数据!A:D,4,0)","v":12}]
[]
[]
[]
[null,"TOTAL:",null,{"$f":"SUM(D$1:D54)","v":1355},"PCS",null,null,{"$f":"SUM(H$1:H54)","v":12195}]

{"sheet":"PACKING LIST","index":2,"n_rows":79,"n_cols":22,"rows_kept":79,"cut":false,"hidden":false,"merged":[[16,10,17,10],[16,11,17,11],[16,12,17,12],[16,13,17,13],[16,14,17,14],[16,15,17,15],[17,4,17,5],[17,6,17,7],[17,8,17,9],[18,10,19,10],[18,11,19,11],[18,12,19,12],[18,13,19,13],[18,14,19,14],[18,15,19,15],[19,4,19,5],[19,6,19,7],[19,8,19,9],[20,10,21,10],[20,11,21,11],[20,12,21,12],[20,13,21,13],[20,14,21,14],[20,15,21,15],[21,4,21,5],[21,6,21,7],[21,8,21,9],[22,10,23,10],[22,11,23,11],[22,12,23,12],[22,13,23,13],[22,14,23,14],[22,15,23,15],[23,4,23,5],[23,6,23,7],[23,8,23,9],[24,10,25,10],[24,11,25,11],[24,12,25,12],[24,13,25,13],[24,14,25,14],[24,15,25,15],[25,4,25,5],[25,6,25,7],[25,8,25,9],[26,10,27,10],[26,11,27,11],[26,12,27,12],[26,13,27,13],[26,14,27,14],[26,15,27,15],[27,4,27,5],[27,6,27,7],[27,8,27,9],[28,10,29,10],[28,11,29,11],[28,12,29,12],[28,13,29,13],[28,14,29,14],[28,15,29,15],[29,4,29,5],[29,6,29,7],[29,8,29,9],[30,10,31,10],[30,11,31,11],[30,12,31,12],[30,13,31,13],[30,14,31,14],[30,15,31,15],[31,4,31,5],[31,6,31,7],[31,8,31,9],[32,10,33,10],[32,11,33,11],[32,12,33,12],[32,13,33,13],[32,14,33,14],[32,15,33,15],[33,4,33,5],[33,6,33,7],[33,8,33,9],[34,10,35,10],[34,11,35,11],[34,12,35,12],[34,13,35,13],[34,14,35,14],[34,15,35,15],[35,4,35,5],[35,6,35,7],[35,8,35,9],[36,10,37,10],[36,11,37,11],[36,12,37,12],[36,13,37,13],[36,14,37,14],[36,15,37,15],[37,4,37,5],[37,6,37,7],[37,8,37,9],[38,10,39,10],[38,11,39,11],[38,12,39,12],[38,13,39,13],[38,14,39,14],[38,15,39,15],[39,4,39,5],[39,6,39,7],[39,8,39,9],[40,10,41,10],[40,11,41,11],[40,12,41,12],[40,13,41,13],[40,14,41,14],[40,15,41,15],[41,4,41,5],[41,6,41,7],[41,8,41,9],[42,10,43,10],[42,11,43,11],[42,12,43,12],[42,13,43,13],[42,14,43,14],[42,15,43,15],[43,4,43,5],[43,6,43,7],[43,8,43,9],[44,10,45,10],[44,11,45,11],[44,12,45,12],[44,13,45,13],[44,14,45,14],[44,15,45,15],[45,4,45,5],[45,6,45,7],[45,8,45,9],[46,10,47,10],[46,11,47,11],[46,12,47,12],[46,13,47,13],[46,14,47,14],[46,15,47,15],[47,4,47,5],[47,6,47,7],[47,8,47,9],[48,10,49,10],[48,11,49,11],[48,12,49,12],[48,13,49,13],[48,14,49,14],[48,15,49,15],[49,4,49,5],[49,6,49,7],[49,8,49,9],[50,10,51,10],[50,11,51,11],[50,12,51,12],[50,13,51,13],[50,14,51,14],[50,15,51,15],[51,4,51,5],[51,6,51,7],[51,8,51,9],[52,10,53,10],[52,11,53,11],[52,12,53,12],[52,13,53,13],[52,14,53,14],[52,15,53,15],[53,4,53,5],[53,6,53,7],[53,8,53,9],[54,10,55,10],[54,11,55,11],[54,12,55,12],[54,13,55,13],[54,14,55,14],[54,15,55,15],[55,4,55,5],[55,6,55,7],[55,8,55,9],[56,10,57,10],[56,11,57,11],[56,12,57,12],[56,13,57,13],[56,14,57,14],[56,15,57,15],[57,4,57,5],[57,6,57,7],[57,8,57,9],[58,10,59,10],[58,11,59,11],[58,12,59,12],[58,13,59,13],[58,14,59,14],[58,15,59,15],[59,4,59,5],[59,6,59,7],[59,8,59,9],[60,10,61,10],[60,11,61,11],[60,12,61,12],[60,13,61,13],[60,14,61,14],[60,15,61,15],[61,4,61,5],[61,6,61,7],[61,8,61,9],[62,10,63,10],[62,11,63,11],[62,12,63,12],[62,13,63,13],[62,14,63,14],[62,15,63,15],[63,4,63,5],[63,6,63,7],[63,8,63,9],[64,10,65,10],[64,11,65,11],[64,12,65,12],[64,13,65,13],[64,14,65,14],[64,15,65,15],[65,4,65,5],[65,6,65,7],[65,8,65,9],[66,10,67,10],[66,11,67,11],[66,12,67,12],[66,13,67,13],[66,14,67,14],[66,15,67,15],[67,4,67,5],[67,6,67,7],[67,8,67,9],[0,0,0,15],[1,0,1,15],[2,0,2,15],[3,0,3,15],[5,2,5,10],[6,2,6,10],[13,0,14,0],[13,1,14,3],[13,4,14,5],[13,6,13,7],[13,8,13,9],[13,10,13,15],[6,20,6,21],[7,9,7,12],[8,0,8,5],[8,9,8,14],[9,0,9,6],[11,1,11,3],[11,5,11,6],[13,20,14,20],[13,21,14,21],[14,6,14,7],[14,8,14,9],[14,10,14,15]]}
["绩能复合材料制品（广州）有限公司",null,null,null,null,null,null,null,null,null,null,null,null,null,null,null,"1、纸箱规格一定要检查是否需要修改？"]
["JI NENG COMPOSITE MATERIALS & PRODUCTS (GUANGZHOU) LTD.",null,null,null,null,null,null,null,null,null,null,null,null,null,null,null,"2、车叉需注意区分类型；"]
["728 Xiagang Blvd., Heng Yun Building 5F Guangzhou Economic & Technology Development District",null,null,null,null,null,null,null,null,null,null,null,null,null,null,null,"3、TFC一个卡板只能放八层，但一层可放5箱"]
["TEL:86-20-22321015 FAX: 86-757-82209433",null,null,null,null,null,null,null,null,null,null,null,null,null,null,null,"4、注意汇总重量数据是否包括全部？"]
[null,null,null,null,null,null,null,null,null,null,null,null,null,null,null,null,null,null,null,null,"考虑先进先出时："]
[null,null,"装箱单",null,null,null,null,null,null,null,null,null,null,null,null,null,null,null,null,null,"请注意库存数据截止时间如下:"]
[null,null,"PACKING LIST",null,null,null,null,null,null,null,null,null,null,null,null,null,null,null,null,null,{"$f":"NOW()","v":"2018-01-30T21:45:22.720"}]
["To Messrs:",null,null,null,null,null,null,null,"Invoice No.:","JEC-",null,null,null,null,null,null,null,null,null,null,"(灰色部分为库存数量暂不够部分)"]
["TRUE TEMPER SPORTS INC.",null,null,null,null,null,null,null,"Date:","2007-08-"]
["ADD: 1020 North Marshall Aven. El Cajon, CA 92020"]
[null,"UTEJMQL33WR-46",null,null,null,null,null,null,null,null,{"$f":"IF(TYPE(VLOOKUP(B:B,[1]重量与单价数据!A$1:I$65536,9,0))=16,\"\",VLOOKUP(B:B,[1]重量与单价数据!A$1:I$65536,9,0))","v":122},"x",{"$f":"IF(TYPE(VLOOKUP(B:B,[1]重量与单价数据!A$1:J$65536,10,0))=16,\"\",VLOOKUP(B:B,[1]重量与单价数据!A$1:J$65536,10,0))","v":15},"x",{"$f":"IF(TYPE(VLOOKUP(B:B,[1]重量与单价数据!A$1:K$65536,11,0))=16,\"\",VLOOKUP(B:B,[1]重量与单价数据!A$1:K$65536,11,0))","v":10},"cm",null,null,null,null,{"$f":"IF(TYPE(VLOOKUP(B:B,[1]制单!A$1:J$65536,10,0))=16,\"\",VLOOKUP(B:B,[1]制单!A$1:J$65536,10,0))","v":""},{"$f":"IF(TYPE(VLOOKUP(B:B,[1]出货计划Remark!A$1:L$65536,12,0))=16,\"\",VLOOKUP(B:B,[1]出货计划Remark!A$1:L$65536,12,0))","v":""}]
["From ","GUANGZHOU，CHINA",null,null,"To"]
[null,null,null,{"$f":"IF(TYPE(VLOOKUP(B:B,[1]制单!A$1:G$65536,7,0))=16,\"\",VLOOKUP(B:B,[1]制单!A$1:G$65536,7,0))","v":""},null,null,null,null,null,null,null,null,null,null,null,null,null,null,null,null,{"$f":"IF(TYPE(VLOOKUP(B:B,[1]制单!A$1:K$65536,11,0))=16,\"\",IF(VLOOKUP(B:B,[1]制单!A$1:K$65536,11,0)>=0,\"\",VLOOKUP(B:B,[1]制单!A$1:K$65536,11,0)))","v":""}]
["CTN\n NO.","DESCRIPTION OF GOODS ",null,null,"QUANTITY",null,"GROSS WEIGHT",null,"NET WEIGHT",null,"MEASUREMENT",null,null,null,null,null,"体积","每支单重","纸箱重量","每箱数量","Inventory\nQTY","Remark"]
[null,null,null,null,null,null,"(KGS)",null,"(KGS)",null,"(cm)",null,null,null,null,null,null,null,null,null,{"$f":"IF(TYPE(VLOOKUP(B:B,[1]制单!A$1:K$65536,11,0))=16,\"\",IF(VLOOKUP(B:B,[1]制单!A$1:K$65536,11,0)>=0,\"\",VLOOKUP(B:B,[1]制单!A$1:K$65536,11,0)))","v":""}]
[null,"高尔夫球杆杆轴11",null,"( 1355PCS )",null,null,null,null,null,null,null,null,null,null,null,null,null,null,null,null,{"$f":"IF(TYPE(VLOOKUP(B:B,[1]制单!A$1:K$65536,11,0))=16,\"\",IF(VLOOKUP(B:B,[1]制单!A$1:K$65536,11,0)>=0,\"\",VLOOKUP(B:B,[1]制单!A$1:K$65536,11,0)))","v":""}]
["1 - 5",{"$f":"INVOICE!B19","v":"BAL-SQRB-11052"},null,null,5,"CARTONS",88.9,"KGS",81.5,"KGS",{"$f":"VLOOKUP(B:B,重量与单价数据!A:I,9,0)","v":145},"x",{"$f":"VLOOKUP(B:B,重量与单价数据!A:J,10,0)","v":29},"x",{"$f":"VLOOKUP(B:B,重量与单价数据!A:K,11,0)","v":16},"cm",{"$f":"E17*K17*M17*O17/1000000","v":0.33639999999999998},{"$f":"VLOOKUP(B:B,重量与单价数据!A:C,3,0)/1000","v":0.32600000000000001},{"$f":"VLOOKUP(B:B,重量与单价数据!A:E,5,0)","v":1.48},{"$f":"VLOOKUP(B:B,重量与单价数据!A:D,4,0)","v":50}]
[null,null,null,null,"( 50 PCS/CTN, 250PCS)",null,"(@17.78 kgs)",null,"(@16.3kgs)"]
["6 - 6",{"$f":"B17","v":"BAL-SQRB-11052"},null,null,1,"CARTONS",16.149999999999999,"KGS",14.67,"KGS",{"$f":"VLOOKUP(B:B,重量与单价数据!A:I,9,0)","v":145},"x",{"$f":"VLOOKUP(B:B,重量与单价数据!A:J,10,0)","v":29},"x",{"$f":"VLOOKUP(B:B,重量与单价数据!A:K,11,0)","v":16},"cm",{"$f":"E19*K19*M19*O19/1000000","v":6.7280000000000006E-2},{"$f":"VLOOKUP(B:B,重量与单价数据!A:C,3,0)/1000","v":0.32600000000000001}]
[null,null,null,null,"( 45 PCS/CTN, 45PCS)",null,"(@16.15 kgs)",null,"(@14.67kgs)"]
["7 - 42",{"$f":"INVOICE!B21","v":"TAQ-1125-ST-CB-70041"},null,null,36,"CARTONS",33.479999999999997,"KGS",15.48,"KGS",{"$f":"VLOOKUP(B:B,重量与单价数据!A:I,9,0)","v":89},"x",{"$f":"VLOOKUP(B:B,重量与单价数据!A:J,10,0)","v":14},"x",{"$f":"VLOOKUP(B:B,重量与单价数据!A:K,11,0)","v":9},"cm",{"$f":"E21*K21*M21*O21/1000000","v":0.40370400000000001},{"$f":"VLOOKUP(B:B,重量与单价数据!A:C,3,0)/1000","v":0.43},{"$f":"VLOOKUP(B:B,重量与单价数据!A:E,5,0)","v":0.5},{"$f":"VLOOKUP(B:B,重量与单价数据!A:D,4,0)","v":1}]
[null,null,null,null,"( 1 PCS/CTN, 36PCS)",null,"(@.93 kgs)",null,"(@.43kgs)"]
["43 - 46",{"$f":"INVOICE!B23","v":"ULAUNCH145TS-46"},null,null,4,"CARTONS",22.2,"KGS",19.8,"KGS",{"$f":"VLOOKUP(B:B,重量与单价数据!A:I,9,0)","v":122},"x",{"$f":"VLOOKUP(B:B,重量与单价数据!A:J,10,0)","v":15},"x",{"$f":"VLOOKUP(B:B,重量与单价数据!A:K,11,0)","v":10},"cm",{"$f":"E23*K23*M23*O23/1000000","v":7.3200000000000001E-2},{"$f":"VLOOKUP(B:B,重量与单价数据!A:C,3,0)/1000","v":9.9000000000000005E-2},{"$f":"VLOOKUP(B:B,重量与单价数据!A:E,5,0)","v":0.6},{"$f":"VLOOKUP(B:B,重量与单价数据!A:D,4,0)","v":50}]
[null,null,null,null,"( 50 PCS/CTN, 200PCS)",null,"(@5.55 kgs)",null,"(@4.95kgs)"]
["47 - 47",{"$f":"B23","v":"ULAUNCH145TS-46"},null,null,1,"CARTONS",3.9660000000000002,"KGS",3.3660000000000001,"KGS",{"$f":"VLOOKUP(B:B,重量与单价数据!A:I,9,0)","v":122},"x",{"$f":"VLOOKUP(B:B,重量与单价数据!A:J,10,0)","v":15},"x",{"$f":"VLOOKUP(B:B,重量与单价数据!A:K,11,0)","v":10},"cm",{"$f":"E25*K25*M25*O25/1000000","v":1.83E-2},{"$f":"VLOOKUP(B:B,重量与单价数据!A:C,3,0)/1000","v":9.9000000000000005E-2}]
[null,null,null,null,"( 34 PCS/CTN, 34PCS)",null,"(@3.966 kgs)",null,"(@3.366kgs)"]
["48 - 48",{"$f":"INVOICE!B25","v":"GSAL355IS-40-T"},null,null,1,"CARTONS",1.8959999999999999,"KGS",1.2959999999999998,"KGS",{"$f":"VLOOKUP(B:B,重量与单价数据!A:I,9,0)","v":122},"x",{"$f":"VLOOKUP(B:B,重量与单价数据!A:J,10,0)","v":15},"x",{"$f":"VLOOKUP(B:B,重量与单价数据!A:K,11,0)","v":10},"cm",{"$f":"E27*K27*M27*O27/1000000","v":1.83E-2},{"$f":"VLOOKUP(B:B,重量与单价数据!A:C,3,0)/1000","v":7.1999999999999995E-2},{"$f":"VLOOKUP(B:B,重量与单价数据!A:E,5,0)","v":0.6},{"$f":"VLOOKUP(B:B,重量与单价数据!A:D,4,0)","v":50}]
[null,null,null,null,"( 18 PCS/CTN, 18PCS)",null,"(@1.896 kgs)",null,"(@1.296kgs)"]
["49 - 98",{"$f":"INVOICE!B27","v":"TAQEX-1125-ST-CB-70044"},null,null,50,"CARTONS",46.5,"KGS",21.5,"KGS",{"$f":"VLOOKUP(B:B,重量与单价数据!A:I,9,0)","v":89},"x",{"$f":"VLOOKUP(B:B,重量与单价数据!A:J,10,0)","v":14},"x",{"$f":"VLOOKUP(B:B,重量与单价数据!A:K,11,0)","v":9},"cm",{"$f":"E29*K29*M29*O29/1000000","v":0.56069999999999998},{"$f":"VLOOKUP(B:B,重量与单价数据!A:C,3,0)/1000","v":0.43},{"$f":"VLOOKUP(B:B,重量与单价数据!A:E,5,0)","v":0.5},{"$f":"VLOOKUP(B:B,重量与单价数据!A:D,4,0)","v":1}]
[null,null,null,null,"( 1 PCS/CTN, 50PCS)",null,"(@.93 kgs)",null,"(@.43kgs)"]
["99 - 102",{"$f":"INVOICE!B29","v":"ULAUNCH145TS-46"},null,null,4,"CARTONS",22.2,"KGS",19.8,"KGS",{"$f":"VLOOKUP(B:B,重量与单价数据!A:I,9,0)","v":122},"x",{"$f":"VLOOKUP(B:B,重量与单价数据!A:J,10,0)","v":15},"x",{"$f":"VLOOKUP(B:B,重量与单价数据!A:K,11,0)","v":10},"cm",{"$f":"E31*K31*M31*O31/1000000","v":7.3200000000000001E-2},{"$f":"VLOOKUP(B:B,重量与单价数据!A:C,3,0)/1000","v":9.9000000000000005E-2},{"$f":"VLOOKUP(B:B,重量与单价数据!A:E,5,0)","v":0.6},{"$f":"VLOOKUP(B:B,重量与单价数据!A:D,4,0)","v":50}]
[null,null,null,null,"( 50 PCS/CTN, 200PCS)",null,"(@5.55 kgs)",null,"(@4.95kgs)"]
["103 - 103",{"$f":"B31","v":"ULAUNCH145TS-46"},null,null,1,"CARTONS",3.9660000000000002,"KGS",3.3660000000000001,"KGS",{"$f":"VLOOKUP(B:B,重量与单价数据!A:I,9,0)","v":122},"x",{"$f":"VLOOKUP(B:B,重量与单价数据!A:J,10,0)","v":15},"x",{"$f":"VLOOKUP(B:B,重量与单价数据!A:K,11,0)","v":10},"cm",{"$f":"E33*K33*M33*O33/1000000","v":1.83E-2},{"$f":"VLOOKUP(B:B,重量与单价数据!A:C,3,0)/1000","v":9.9000000000000005E-2}]
[null,null,null,null,"( 34 PCS/CTN, 34PCS)",null,"(@3.966 kgs)",null,"(@3.366kgs)"]
["104 - 104",{"$f":"INVOICE!B31","v":"GSAL355IS-40-T"},null,null,1,"CARTONS",1.8959999999999999,"KGS",1.2959999999999998,"KGS",{"$f":"VLOOKUP(B:B,重量与单价数据!A:I,9,0)","v":122},"x",{"$f":"VLOOKUP(B:B,重量与单价数据!A:J,10,0)","v":15},"x",{"$f":"VLOOKUP(B:B,重量与单价数据!A:K,11,0)","v":10},"cm",{"$f":"E35*K35*M35*O35/1000000","v":1.83E-2},{"$f":"VLOOKUP(B:B,重量与单价数据!A:C,3,0)/1000","v":7.1999999999999995E-2},{"$f":"VLOOKUP(B:B,重量与单价数据!A:E,5,0)","v":0.6},{"$f":"VLOOKUP(B:B,重量与单价数据!A:D,4,0)","v":50}]
[null,null,null,null,"( 18 PCS/CTN, 18PCS)",null,"(@1.896 kgs)",null,"(@1.296kgs)"]
["105 - 105",{"$f":"INVOICE!B33","v":"CCM-V8-TT-4556"},null,null,1,"CARTONS",10.98,"KGS",9.5,"KGS",{"$f":"VLOOKUP(B:B,重量与单价数据!A:I,9,0)","v":145},"x",{"$f":"VLOOKUP(B:B,重量与单价数据!A:J,10,0)","v":29},"x",{"$f":"VLOOKUP(B:B,重量与单价数据!A:K,11,0)","v":16},"cm",{"$f":"E37*K37*M37*O37/1000000","v":6.7280000000000006E-2},{"$f":"VLOOKUP(B:B,重量与单价数据!A:C,3,0)/1000","v":0.38},{"$f":"VLOOKUP(B:B,重量与单价数据!A:E,5,0)","v":1.48},{"$f":"VLOOKUP(B:B,重量与单价数据!A:D,4,0)","v":50}]
[null,null,null,null,"( 25 PCS/CTN, 25PCS)",null,"(@10.98 kgs)",null,"(@9.5kgs)"]
["106 - 107",{"$f":"INVOICE!B35","v":"SHR-RM19-P225-G01L-57"},null,null,2,"CARTONS",22.2,"KGS",17.759999999999998,"KGS",{"$f":"VLOOKUP(B:B,重量与单价数据!A:I,9,0)","v":179},"x",{"$f":"VLOOKUP(B:B,重量与单价数据!A:J,10,0)","v":42},"x",{"$f":"VLOOKUP(B:B,重量与单价数据!A:K,11,0)","v":15},"cm",{"$f":"E39*K39*M39*O39/1000000","v":0.22553999999999999},{"$f":"VLOOKUP(B:B,重量与单价数据!A:C,3,0)/1000","v":0.74},{"$f":"VLOOKUP(B:B,重量与单价数据!A:E,5,0)","v":2.2200000000000002},{"$f":"VLOOKUP(B:B,重量与单价数据!A:D,4,0)","v":12}]
[null,null,null,null,"( 12 PCS/CTN, 24PCS)",null,"(@11.1 kgs)",null,"(@8.88kgs)"]
["108 - 108",{"$f":"B39","v":"SHR-RM19-P225-G01L-57"},null,null,1,"CARTONS",2.96,"KGS",0.74,"KGS",{"$f":"VLOOKUP(B:B,重量与单价数据!A:I,9,0)","v":179},"x",{"$f":"VLOOKUP(B:B,重量与单价数据!A:J,10,0)","v":42},"x",{"$f":"VLOOKUP(B:B,重量与单价数据!A:K,11,0)","v":15},"cm",{"$f":"E41*K41*M41*O41/1000000","v":0.11277},{"$f":"VLOOKUP(B:B,重量与单价数据!A:C,3,0)/1000","v":0.74}]
[null,null,null,null,"( 1 PCS/CTN, 1PCS)",null,"(@2.96 kgs)",null,"(@.74kgs)"]
["109 - 110",{"$f":"INVOICE!B37","v":"SHR-RM19-P225-G01L-57"},null,null,2,"CARTONS",22.2,"KGS",17.759999999999998,"KGS",{"$f":"VLOOKUP(B:B,重量与单价数据!A:I,9,0)","v":179},"x",{"$f":"VLOOKUP(B:B,重量与单价数据!A:J,10,0)","v":42},"x",{"$f":"VLOOKUP(B:B,重量与单价数据!A:K,11,0)","v":15},"cm",{"$f":"E43*K43*M43*O43/1000000","v":0.22553999999999999},{"$f":"VLOOKUP(B:B,重量与单价数据!A:C,3,0)/1000","v":0.74},{"$f":"VLOOKUP(B:B,重量与单价数据!A:E,5,0)","v":2.2200000000000002},{"$f":"VLOOKUP(B:B,重量与单价数据!A:D,4,0)","v":12}]
[null,null,null,null,"( 12 PCS/CTN, 24PCS)",null,"(@11.1 kgs)",null,"(@8.88kgs)"]
["111 - 111",{"$f":"B43","v":"SHR-RM19-P225-G01L-57"},null,null,1,"CARTONS",2.96,"KGS",0.74,"KGS",{"$f":"VLOOKUP(B:B,重量与单价数据!A:I,9,0)","v":179},"x",{"$f":"VLOOKUP(B:B,重量与单价数据!A:J,10,0)","v":42},"x",{"$f":"VLOOKUP(B:B,重量与单价数据!A:K,11,0)","v":15},"cm",{"$f":"E45*K45*M45*O45/1000000","v":0.11277},{"$f":"VLOOKUP(B:B,重量与单价数据!A:C,3,0)/1000","v":0.74}]
[null,null,null,null,"( 1 PCS/CTN, 1PCS)",null,"(@2.96 kgs)",null,"(@.74kgs)"]
["112 - 112",{"$f":"INVOICE!B39","v":"GSAL355IS-40-T"},null,null,1,"CARTONS",1.8959999999999999,"KGS",1.2959999999999998,"KGS",{"$f":"VLOOKUP(B:B,重量与单价数据!A:I,9,0)","v":122},"x",{"$f":"VLOOKUP(B:B,重量与单价数据!A:J,10,0)","v":15},"x",{"$f":"VLOOKUP(B:B,重量与单价数据!A:K,11,0)","v":10},"cm",{"$f":"E47*K47*M47*O47/1000000","v":1.83E-2},{"$f":"VLOOKUP(B:B,重量与单价数据!A:C,3,0)/1000","v":7.1999999999999995E-2},{"$f":"VLOOKUP(B:B,重量与单价数据!A:E,5,0)","v":0.6},{"$f":"VLOOKUP(B:B,重量与单价数据!A:D,4,0)","v":50}]
[null,null,null,null,"( 18 PCS/CTN, 18PCS)",null,"(@1.896 kgs)",null,"(@1.296kgs)"]
["113 - 162",{"$f":"INVOICE!B41","v":"TAQEX-1125-ST-CB-70044"},null,null,50,"CARTONS",46.5,"KGS",21.5,"KGS",{"$f":"VLOOKUP(B:B,重量与单价数据!A:I,9,0)","v":89},"x",{"$f":"VLOOKUP(B:B,重量与单价数据!A:J,10,0)","v":14},"x",{"$f":"VLOOKUP(B:B,重量与单价数据!A:K,11,0)","v":9},"cm",{"$f":"E49*K49*M49*O49/1000000","v":0.56069999999999998},{"$f":"VLOOKUP(B:B,重量与单价数据!A:C,3,0)/1000","v":0.43},{"$f":"VLOOKUP(B:B,重量与单价数据!A:E,5,0)","v":0.5},{"$f":"VLOOKUP(B:B,重量与单价数据!A:D,4,0)","v":1}]
[null,null,null,null,"( 1 PCS/CTN, 50PCS)",null,"(@.93 kgs)",null,"(@.43kgs)"]
["163 - 166",{"$f":"INVOICE!B43","v":"ULAUNCH145TS-46"},null,null,4,"CARTONS",22.2,"KGS",19.8,"KGS",{"$f":"VLOOKUP(B:B,重量与单价数据!A:I,9,0)","v":122},"x",{"$f":"VLOOKUP(B:B,重量与单价数据!A:J,10,0)","v":15},"x",{"$f":"VLOOKUP(B:B,重量与单价数据!A:K,11,0)","v":10},"cm",{"$f":"E51*K51*M51*O51/1000000","v":7.3200000000000001E-2},{"$f":"VLOOKUP(B:B,重量与单价数据!A:C,3,0)/1000","v":9.9000000000000005E-2},{"$f":"VLOOKUP(B:B,重量与单价数据!A:E,5,0)","v":0.6},{"$f":"VLOOKUP(B:B,重量与单价数据!A:D,4,0)","v":50}]
[null,null,null,null,"( 50 PCS/CTN, 200PCS)",null,"(@5.55 kgs)",null,"(@4.95kgs)"]
["167 - 167",{"$f":"B51","v":"ULAUNCH145TS-46"},null,null,1,"CARTONS",3.9660000000000002,"KGS",3.3660000000000001,"KGS",{"$f":"VLOOKUP(B:B,重量与单价数据!A:I,9,0)","v":122},"x",{"$f":"VLOOKUP(B:B,重量与单价数据!A:J,10,0)","v":15},"x",{"$f":"VLOOKUP(B:B,重量与单价数据!A:K,11,0)","v":10},"cm",{"$f":"E53*K53*M53*O53/1000000","v":1.83E-2},{"$f":"VLOOKUP(B:B,重量与单价数据!A:C,3,0)/1000","v":9.9000000000000005E-2}]
[null,null,null,null,"( 34 PCS/CTN, 34PCS)",null,"(@3.966 kgs)",null,"(@3.366kgs)"]
["168 - 168",{"$f":"INVOICE!B45","v":"GSAL355IS-40-T"},null,null,1,"CARTONS",1.8959999999999999,"KGS",1.2959999999999998,"KGS",{"$f":"VLOOKUP(B:B,重量与单价数据!A:I,9,0)","v":122},"x",{"$f":"VLOOKUP(B:B,重量与单价数据!A:J,10,0)","v":15},"x",{"$f":"VLOOKUP(B:B,重量与单价数据!A:K,11,0)","v":10},"cm",{"$f":"E55*K55*M55*O55/1000000","v":1.83E-2},{"$f":"VLOOKUP(B:B,重量与单价数据!A:C,3,0)/1000","v":7.1999999999999995E-2},{"$f":"VLOOKUP(B:B,重量与单价数据!A:E,5,0)","v":0.6},{"$f":"VLOOKUP(B:B,重量与单价数据!A:D,4,0)","v":50}]
[null,null,null,null,"( 18 PCS/CTN, 18PCS)",null,"(@1.896 kgs)",null,"(@1.296kgs)"]
["169 - 169",{"$f":"INVOICE!B47","v":"CCM-V8-TT-4556"},null,null,1,"CARTONS",10.98,"KGS",9.5,"KGS",{"$f":"VLOOKUP(B:B,重量与单价数据!A:I,9,0)","v":145},"x",{"$f":"VLOOKUP(B:B,重量与单价数据!A:J,10,0)","v":29},"x",{"$f":"VLOOKUP(B:B,重量与单价数据!A:K,11,0)","v":16},"cm",{"$f":"E57*K57*M57*O57/1000000","v":6.7280000000000006E-2},{"$f":"VLOOKUP(B:B,重量与单价数据!A:C,3,0)/1000","v":0.38},{"$f":"VLOOKUP(B:B,重量与单价数据!A:E,5,0)","v":1.48},{"$f":"VLOOKUP(B:B,重量与单价数据!A:D,4,0)","v":50}]
[null,null,null,null,"( 25 PCS/CTN, 25PCS)",null,"(@10.98 kgs)",null,"(@9.5kgs)"]
["170 - 171",{"$f":"INVOICE!B49","v":"SHR-RM19-P225-G01L-57"},null,null,2,"CARTONS",22.2,"KGS",17.759999999999998,"KGS",{"$f":"VLOOKUP(B:B,重量与单价数据!A:I,9,0)","v":179},"x",{"$f":"VLOOKUP(B:B,重量与单价数据!A:J,10,0)","v":42},"x",{"$f":"VLOOKUP(B:B,重量与单价数据!A:K,11,0)","v":15},"cm",{"$f":"E59*K59*M59*O59/1000000","v":0.22553999999999999},{"$f":"VLOOKUP(B:B,重量与单价数据!A:C,3,0)/1000","v":0.74},{"$f":"VLOOKUP(B:B,重量与单价数据!A:E,5,0)","v":2.2200000000000002},{"$f":"VLOOKUP(B:B,重量与单价数据!A:D,4,0)","v":12}]
[null,null,null,null,"( 12 PCS/CTN, 24PCS)",null,"(@11.1 kgs)",null,"(@8.88kgs)"]
["172 - 172",{"$f":"B59","v":"SHR-RM19-P225-G01L-57"},null,null,1,"CARTONS",2.96,"KGS",0.74,"KGS",{"$f":"VLOOKUP(B:B,重量与单价数据!A:I,9,0)","v":179},"x",{"$f":"VLOOKUP(B:B,重量与单价数据!A:J,10,0)","v":42},"x",{"$f":"VLOOKUP(B:B,重量与单价数据!A:K,11,0)","v":15},"cm",{"$f":"E61*K61*M61*O61/1000000","v":0.11277},{"$f":"VLOOKUP(B:B,重量与单价数据!A:C,3,0)/1000","v":0.74}]
[null,null,null,null,"( 1 PCS/CTN, 1PCS)",null,"(@2.96 kgs)",null,"(@.74kgs)"]
["173 - 174",{"$f":"INVOICE!B51","v":"SHR-RM19-P225-G01L-57"},null,null,2,"CARTONS",22.2,"KGS",17.759999999999998,"KGS",{"$f":"VLOOKUP(B:B,重量与单价数据!A:I,9,0)","v":179},"x",{"$f":"VLOOKUP(B:B,重量与单价数据!A:J,10,0)","v":42},"x",{"$f":"VLOOKUP(B:B,重量与单价数据!A:K,11,0)","v":15},"cm",{"$f":"E63*K63*M63*O63/1000000","v":0.22553999999999999},{"$f":"VLOOKUP(B:B,重量与单价数据!A:C,3,0)/1000","v":0.74},{"$f":"VLOOKUP(B:B,重量与单价数据!A:E,5,0)","v":2.2200000000000002},{"$f":"VLOOKUP(B:B,重量与单价数据!A:D,4,0)","v":12}]
[null,null,null,null,"( 12 PCS/CTN, 24PCS)",null,"(@11.1 kgs)",null,"(@8.88kgs)"]
["175 - 175",{"$f":"B63","v":"SHR-RM19-P225-G01L-57"},null,null,1,"CARTONS",2.96,"KGS",0.74,"KGS",{"$f":"VLOOKUP(B:B,重量与单价数据!A:I,9,0)","v":179},"x",{"$f":"VLOOKUP(B:B,重量与单价数据!A:J,10,0)","v":42},"x",{"$f":"VLOOKUP(B:B,重量与单价数据!A:K,11,0)","v":15},"cm",{"$f":"E65*K65*M65*O65/1000000","v":0.11277},{"$f":"VLOOKUP(B:B,重量与单价数据!A:C,3,0)/1000","v":0.74}]
[null,null,null,null,"( 1 PCS/CTN, 1PCS)",null,"(@2.96 kgs)",null,"(@.74kgs)"]
[]
[]
[null,"TOTAL:",175,"CARTONS/",1355,"(PCS)",{"$f":"SUM(G$1:G68)","v":440.21199999999988},"KGS",{"$f":"SUM(I$1:I68)","v":322.33199999999999},"KGS",null,null,null,null,null,null,{"$f":"IF(TYPE(VLOOKUP(B:B,#REF!,8,0))=16,\"\",VLOOKUP(B:B,#REF!,8,0))","v":""}]
["REMARK:",null,null,null,null,null,null,null,null,null,null,null,null,null,null,null,{"$f":"IF(TYPE(VLOOKUP(B:B,#REF!,8,0))=16,\"\",VLOOKUP(B:B,#REF!,8,0))","v":""}]
["1. Pallet QTY: ",null,null," Pallet(s)",null,null,null,null,null,null,null,null,null,null,null,null,{"$f":"IF(TYPE(VLOOKUP(B:B,#REF!,8,0))=16,\"\",VLOOKUP(B:B,#REF!,8,0))","v":""}]
["2.Ture Temper Order Number: ",null,null,null,null,null,null,null,null,null,null,null,null,null,null,null,{"$f":"IF(TYPE(VLOOKUP(B:B,#REF!,8,0))=16,\"\",VLOOKUP(B:B,#REF!,8,0))","v":""}]
["3.Customer Name:"]
["4.Ship to:"]
["5.Delivery NO:"]
["6.Method of Transportation :"]
["7.Packing  requirement:"]
["8. Other Detail Description:",null,{"$f":"VLOOKUP($C$73,'[1]物料编码对照表&客户要求'!E$1:F$65536,2,0)","v":{"$error":"#N/A"}}]
[null,null,null,null,null,null,"Ji Neng Composite Material& Products (Guangzhou) Co., Ltd.",null,null,null,null,null,null,null,null,null,{"$f":"IF(TYPE(VLOOKUP(B:B,#REF!,8,0))=16,\"\",VLOOKUP(B:B,#REF!,8,0))","v":""}]

{"sheet":"重量与单价数据","index":3,"n_rows":1492,"n_cols":15,"rows_kept":1492,"cut":false,"hidden":false,"merged":[]}
["SKU","Price","Item weight(gross)","packed qty","gross weight","company sp","type","carton size","carton(length)","carton(width)","carton(height)","engineer data","on-hand QTY","estimated weight","Weight weighed"]
["AUCRULRLSIL-38",9,74,50,0.6,1,"golf","122*15*10",122,15,10,{"$error":"#N/A"},12,"Y"]
["AUCRULRLSIM-40",9,74,50,0.6,2,"golf","122*15*10",122,15,10,{"$error":"#N/A"},24,"Y"]
["AUCRULRLSWL-44",9,74,50,0.6,3,"golf","122*15*10",122,15,10,{"$error":"#N/A"},3,"Y"]
["AUPL-76-WA-46",9,65,50,0.6,4,"golf","122*15*10",122,15,10,"59-65",0]
["AUPL-76-WS-46",9,70,50,0.6,5,"golf","122*15*10",122,15,10,"64－70",0]
["I19A-55PA-03600",9,71,50,0.6,6,"golf","122*15*10",122,15,10,"67-71",0]
["I19A-55PR-03600",9,73,50,0.6,7,"golf","122*15*10",122,15,10,"69-73",0]
["I19A-55PS-03600",9,75,50,0.6,8,"golf","122*15*10",122,15,10,"71-75",0]
["I19A-60PA-03600",9,71,50,0.6,9,"golf","122*15*10",122,15,10,"67-71",0]
["I19A-60PR-03600",9,73,50,0.6,10,"golf","122*15*10",122,15,10,"69-73",0]
["I19A-60PS-03600",9,75,50,0.6,11,"golf","122*15*10",122,15,10,"71-75",0]
["I19A-65PA-03600",9,71,50,0.6,12,"golf","122*15*10",122,15,10,"67-71",0]
["I19A-65PR-03600",9,73,50,0.6,13,"golf","122*15*10",122,15,10,"69-73",0]
["I19A-65PS-03600",9,75,50,0.6,14,"golf","122*15*10",122,15,10,"71-75",0]
["I19A-70PA-03600",9,71,50,0.6,15,"golf","122*15*10",122,15,10,"67-71",0]
["I19A-70PR-03600",9,73,50,0.6,16,"golf","122*15*10",122,15,10,"69-73",0]
["I19A-70PS-03600",9,75,50,0.6,17,"golf","122*15*10",122,15,10,"71-75",0]
["I19A-75PA-03600",9,71,50,0.6,18,"golf","122*15*10",122,15,10,"67-71",0]
["I19A-75PR-03600",9,73,50,0.6,19,"golf","122*15*10",122,15,10,"69-73",0]
["I19A-75PS-03600",9,75,50,0.6,20,"golf","122*15*10",122,15,10,"71-75",0]
["I19A-80PA-03600",9,71,50,0.6,21,"golf","122*15*10",122,15,10,"67-71",0]
["I19A-80PR-03600",9,73,50,0.6,22,"golf","122*15*10",122,15,10,"69-73",0]
["I19A-80PS-03600",9,75,50,0.6,23,"golf","122*15*10",122,15,10,"71-75",0]
["I19A-85PA-03600",9,71,50,0.6,24,"golf","122*15*10",122,15,10,"67-71",0]
["I19A-85PR-03600",9,73,50,0.6,25,"golf","122*15*10",122,15,10,"69-73",0]
["I19A-85PS-03600",9,75,50,0.6,26,"golf","122*15*10",122,15,10,"71-75",0]
["I19A-90PA-03600",9,71,50,0.6,27,"golf","122*15*10",122,15,10,"67-71",0]
["I19A-90PR-03600",9,73,50,0.6,28,"golf","122*15*10",122,15,10,"69-73",0]
["I19A-90PS-03600",9,75,50,0.6,29,"golf","122*15*10",122,15,10,"71-75",0]
["I19A-95PA-03600",9,71,50,0.6,30,"golf","122*15*10",122,15,10,"67-71",0]
["I19A-95PR-03600",9,73,50,0.6,31,"golf","122*15*10",122,15,10,"69-73",0]
["I19A-95PS-03600",9,75,50,0.6,32,"golf","122*15*10",122,15,10,"71-75",0]
["LAUNCHHYIA-41",9,77,50,0.6,33,"golf","122*15*10",122,15,10,"71-77",67]
["LAUNCHHYIR-41",9,83,50,0.6,34,"golf","122*15*10",122,15,10,"77-83",185]
["LAUNCHHYIS-41",9,84,50,0.6,35,"golf","122*15*10",122,15,10,"78-84",56]
["LAUNCHHYIX-41",9,85,50,0.6,36,"golf","122*15*10",122,15,10,"79-85",337]
["M18L-P-L-22745",9,64,50,0.6,37,"golf","122*15*10",122,15,10,"58-64",0]
["MGBGA-45",9,78,50,0.6,38,"golf","122*15*10",122,15,10,"70-78",0]
["MGBGL-45",9,78,50,0.6,39,"golf","122*15*10",122,15,10,"70-78",0]
["MGBGR3-45",9,82,50,0.6,40,"golf","122*15*10",122,15,10,"74-82",50]
["OGWX-46",9,70,50,0.6,41,"golf","122*15*10",122,15,10,{"$error":"#N/A"},24,"Y","Y"]
["SHR-ECL-08563",9,364,50,1.6,42,"Shaft","183*29*16",183,29,16,"352-364",98]
["SHR-ECL-09563",9,375,50,1.6,43,"Shaft","183*29*16",183,29,16,"363-375",18]
["SHR-ECL-10563",9,384,50,1.6,44,"Shaft","183*29*16",183,29,16,"372-384",235]
["SHR-TEN-TF",9,75,60,0.2,45,"tennon","45*26*8",45,26,8,{"$error":"#N/A"},405,"Y"]
["SHR-TF-09552P",9,329,50,1.48,46,"Shaft","145*29*16",145,29,16,"315-329",0]
["SHR-TF-10552P",9,339,50,1.48,47,"Shaft","145*29*16",145,29,16,"325-339",0]
["SHR-TF-11552P",9,364,50,1.48,48,"Shaft","145*29*16",145,29,16,"350-364",25]
["TITUNPLFWR-44",9,73,50,0.6,49,"golf","122*15*10",122,15,10,"67-73",0]
["TITUNPLFWS-44",9,75,50,0.6,50,"golf","122*15*10",122,15,10,"69-75",0]
["TITUNPLFWX-44",9,77,50,0.6,51,"golf","122*15*10",122,15,10,"71-77",0]
["TITUNPLWR-46",9,65,50,0.6,52,"golf","122*15*10",122,15,10,"59-65",10]
["TITUNPLWS-46",9,67,50,0.6,53,"golf","122*15*10",122,15,10,"61-67",9]
["TTSW-37",9,108,50,0.6,54,"golf","122*15*10",122,15,10,"104-108",0]
["UACLIC-43",9,85,50,0.6,55,"golf","122*15*10",122,15,10,"77-85",85]
["UACLIL-42",9,84,50,0.6,56,"golf","122*15*10",122,15,10,"76-84",1]
["UACLWC-48",9,77,50,0.64,57,"golf","130*15*10",130,15,10,"71-77",798]
["UACLWL-45",9,64,50,0.6,58,"golf","122*15*10",122,15,10,"58-64",10]
["UBEPRO6533WR-45",9,72,50,0.6,59,"golf","122*15*10",122,15,10,"66-72",0]
["UBLU433WR-46",9,46,50,0.6,60,"golf","122*15*10",122,15,10,"40-46",0]
["UBLU533WR-46",9,59,50,0.6,61,"golf","122*15*10",122,15,10,"53-59",0]
["UBLU533WS-46",9,60,50,0.6,62,"golf","122*15*10",122,15,10,"54-60",0]
["UBLU533WX-46",9,61,50,0.6,63,"golf","122*15*10",122,15,10,"55-61",0]
["UBLU633WR-46",9,67,50,0.6,64,"golf","122*15*10",122,15,10,"61-67",371]
["UBLU633WS-46",9,68,50,0.6,65,"golf","122*15*10",122,15,10,"62-68",292]
["UBLU633WX-46",9,67,50,0.6,66,"golf","122*15*10",122,15,10,"61-67",1]
["UBLU635WR-46",9,70,50,0.6,67,"golf","122*15*10",122,15,10,"64-70",124]
["UBLU635WR-46-BT",9,69,50,0.6,68,"golf","122*15*10",122,15,10,"63-69",92]
["UBLU635WS-46",9,69,50,0.6,69,"golf","122*15*10",122,15,10,"63-69",13]
["UBLU635WS-46-BT",9,69,50,0.6,70,"golf","122*15*10",122,15,10,"63-69",128]
["UBLU635WX-46",9,69,50,0.6,71,"golf","122*15*10",122,15,10,"63-69",15]
["UBLU635WX-46-BT",9,69,50,0.6,72,"golf","122*15*10",122,15,10,"63-69",121]
["UBLU733FPS-46",9,78,50,0.6,73,"golf","122*15*10",122,15,10,"72-78",15]
["UBLU733WR-46",9,76,50,0.6,74,"golf","122*15*10",122,15,10,"70-76",360]
["UBLU733WS-46",9,78,50,0.6,75,"golf","122*15*10",122,15,10,"72-78",249]
["UBLU733WX-46",9,80,50,0.6,76,"golf","122*15*10",122,15,10,"74-80",36]
["UBLU735WR-46",9,81,50,0.6,77,"golf","122*15*10",122,15,10,"75-81",17]
["UBLU735WS-46",9,80,50,0.6,78,"golf","122*15*10",122,15,10,"74-80",10]
["UBLU735WX-46",9,82,50,0.6,79,"golf","122*15*10",122,15,10,"76-82",0]
["UBLU933WS-46",9,96,50,0.6,80,"golf","122*15*10",122,15,10,"90-96",19]
["UBLU933WX-46",9,96,50,0.6,81,"golf","122*15*10",122,15,10,"90-96",0]
["UBLULD33-50-1X2X",9,77,50,0.64,82,"golf","130*15*10",130,15,10,"71-77",0]
["UBLULD33-50-2X3X",9,78,50,0.64,83,"golf","130*15*10",130,15,10,"72-78",0]
["UBLULD33-50-4X5X",9,79,50,0.64,84,"golf","130*15*10",130,15,10,"73-79",17]
["UBLUTIT33WR-46",9,69,50,0.6,85,"golf","122*15*10",122,15,10,"63-69",89]
["UBLUTIT33WS-46",9,68,50,0.6,86,"golf","122*15*10",122,15,10,"62-68",3]
["UBLUTIT33WX-46",9,68,50,0.6,87,"golf","122*15*10",122,15,10,"62-68",7]
["UBLUTW33WX-46",9,98,50,0.6,88,"golf","122*15*10",122,15,10,"92-98",14]
["UBROP6533WL-45",9,64,50,0.6,89,"golf","122*15*10",122,15,10,"58-64",0]
["UBROP6533WR-45",9,72,50,0.6,90,"golf","122*15*10",122,15,10,"66-72",0]
["UBROP6533WS-45",9,74,50,0.6,91,"golf","122*15*10",122,15,10,"68-74",23]
["UBROP70IL-40",9,82,50,0.6,92,"golf","122*15*10",122,15,10,"76-82",0]
["UBROP70IR-40",9,82,50,0.6,93,"golf","122*15*10",122,15,10,"76-82",0]
["UBROP70IS-40",9,80,50,0.6,94,"golf","122*15*10",122,15,10,"74-80",0]
["UEI233WR-46",9,78,50,0.6,95,"golf","122*15*10",122,15,10,"72-78",0]
["UEI233WR-46-DG",9,78,50,0.6,96,"golf","122*15*10",122,15,10,"72-78",0]
["UEI233WS-46",9,81,50,0.6,97,"golf","122*15*10",122,15,10,"75-81",0]
["UEI233WS-46-DG",9,81,50,0.6,98,"golf","122*15*10",122,15,10,"75-81",0]
["UEI233WX-46",9,81,50,0.6,99,"golf","122*15*10",122,15,10,"75-81",0]
["UEI233WXX-46",9,82,50,0.6,100,"golf","122*15*10",122,15,10,"76-82",0]
["UEI235WR-46",9,79,50,0.6,101,"golf","122*15*10",122,15,10,"73-79",0]
["UEI235WS-46",9,83,50,0.6,102,"golf","122*15*10",122,15,10,"77-83",0]
["UEI235WX-46",9,84,50,0.6,103,"golf","122*15*10",122,15,10,"78-84",0]
["UGSAL33WA-45",9,68,50,0.6,104,"golf","122*15*10",122,15,10,"62-68",381]
["UGSAL33WL-45",9,64,50,0.6,105,"golf","122*15*10",122,15,10,"58-64",43]
["UGSAL33WR-45",9,72,50,0.6,106,"golf","122*15*10",122,15,10,"66-72",0]
["UGSAL33WS-45",9,74,50,0.6,107,"golf","122*15*10",122,15,10,"68-74",0]
["UGSAL37IA-40",9,66,50,0.6,108,"golf","122*15*10",122,15,10,"60-66",6]
["UGSAL37IL-40",9,65,50,0.6,109,"golf","122*15*10",122,15,10,"59-65",5]
["UGSAL37IR-40",9,69,50,0.6,110,"golf","122*15*10",122,15,10,"63-69",80]
["UGSAL37IS-40",9,72,50,0.6,111,"golf","122*15*10",122,15,10,"66-72",289]
["UGSMX3IC-43",9,74,50,0.6,112,"golf","122*15*10",122,15,10,"68-74",0]
["UGSSA33WA-45",9,65,50,0.6,113,"golf","122*15*10",122,15,10,"59-65",22]
["UGSSA33WL-45",9,65,50,0.6,114,"golf","122*15*10",122,15,10,"59-65",28]
["UGSSA33WR-45",9,67,50,0.6,115,"golf","122*15*10",122,15,10,"61-67",0]
["UGSSA33WS-45",9,70,50,0.6,116,"golf","122*15*10",122,15,10,"64-70",0]
["UHBGS2IL-395",9,80,50,0.6,117,"golf","122*15*10",122,15,10,{"$error":"#N/A"},11,"Y","y"]
["UHBGS2IM-41",9,80,50,0.6,118,"golf","122*15*10",122,15,10,{"$error":"#N/A"},22,"Y","y"]
["UHBGS2WM-465",9,80,50,0.6,119,"golf","122*15*10",122,15,10,{"$error":"#N/A"},21,"Y","y"]
["ULAUNCH433WA-46",9,46,50,0.6,120,"golf","122*15*10",122,15,10,"40-46",10]
["ULAUNCH433WL-46",9,47,50,0.6,121,"golf","122*15*10",122,15,10,"41-47",0]
["ULAUNCH433WR-46",9,46,50,0.6,122,"golf","122*15*10",122,15,10,"40-46",314]
["ULAUNCH433WS-46",9,51,50,0.6,123,"golf","122*15*10",122,15,10,"45-51",0]
["ULAUNCH435WA-46",9,48,50,0.6,124,"golf","122*15*10",122,15,10,"42-48",11]
["ULAUNCH435WL-46",9,47,50,0.6,125,"golf","122*15*10",122,15,10,"41-47",54]
["ULAUNCH435WR-46",9,47,50,0.6,126,"golf","122*15*10",122,15,10,"41-47",24]
["ULAUNCH435WS-46",9,51,50,0.6,127,"golf","122*15*10",122,15,10,"45-51",9]
["ULAUNCH533WR-46",9,59,50,0.6,128,"golf","122*15*10",122,15,10,"53-59",221]
["ULAUNCH533WS-46",9,60,50,0.6,129,"golf","122*15*10",122,15,10,"54-60",8]
["ULAUNCH533WX-46",9,61,50,0.6,130,"golf","122*15*10",122,15,10,"55-61",30]
["ULAUNCH535WR-46",9,60,50,0.6,131,"golf","122*15*10",122,15,10,"54-60",90]
["ULAUNCH535WS-46",9,62,50,0.6,132,"golf","122*15*10",122,15,10,"56-62",9]
["ULAUNCH535WX-46",9,62,50,0.6,133,"golf","122*15*10",122,15,10,"56-62",13]
["ULAUNCH5SEWR-46",9,59,50,0.6,134,"golf","122*15*10",122,15,10,"53-59",0]
["ULAUNCH633WR-46",9,69,50,0.6,135,"golf","122*15*10",122,15,10,"63-69",544]
["ULAUNCH633WS-46",9,67,50,0.6,136,"golf","122*15*10",122,15,10,"61-67",16]
["ULAUNCH633WX-46",9,68,50,0.6,137,"golf","122*15*10",122,15,10,"62-68",1559]
["ULAUNCH635WR-46",9,70,50,0.6,138,"golf","122*15*10",122,15,10,"64-70",602]
["ULAUNCH635WS-46",9,70,50,0.6,139,"golf","122*15*10",122,15,10,"64-70",881]
["ULAUNCH635WX-46",9,70,50,0.6,140,"golf","122*15*10",122,15,10,"64-70",440]
["ULAUNCH733WR-46",9,77,50,0.6,141,"golf","122*15*10",122,15,10,"71-77",52]
["ULAUNCH733WS-46",9,77,50,0.6,142,"golf","122*15*10",122,15,10,"71-77",51]
["ULAUNCH733WX-46",9,78,50,0.6,143,"golf","122*15*10",122,15,10,"72-78",0]
["ULAUNCH735WR-46",9,78,50,0.6,144,"golf","122*15*10",122,15,10,"72-78",414]
["ULAUNCH735WS-46",9,79,50,0.6,145,"golf","122*15*10",122,15,10,"73-79",635]
["ULAUNCH735WX-46",9,78,50,0.6,146,"golf","122*15*10",122,15,10,"72-78",565]
["ULAUNCHHY33WA-41",9,79,50,0.6,147,"golf","122*15*10",122,15,10,"73-79",62]
["ULAUNCHHY33WR-41",9,84,50,0.6,148,"golf","122*15*10",122,15,10,"78-84",7]
["ULAUNCHHY33WS-41",9,86,50,0.6,149,"golf","122*15*10",122,15,10,"80-86",0]
["ULAUNCHHY33WX-41",9,85,50,0.6,150,"golf","122*15*10",122,15,10,"79-85",33]
["ULAUNCHHYIA-41",9,78,50,0.6,151,"golf","122*15*10",122,15,10,"72-78",16]
["ULAUNCHHYIR-41",9,84,50,0.6,152,"golf","122*15*10",122,15,10,"78-84",43]
["ULAUNCHHYIS-41",9,85,50,0.6,153,"golf","122*15*10",122,15,10,"79-85",98]
["ULAUNCHHYIX-41",9,85,50,0.6,154,"golf","122*15*10",122,15,10,"79-85",340]
["ULAUNCHIA-41",9,84,50,0.6,155,"golf","122*15*10",122,15,10,"78-84",0]
["ULAUNCHIR-41",9,81,50,0.6,156,"golf","122*15*10",122,15,10,"75-81",0]
["ULAUNCHIS-41",9,86,50,0.6,157,"golf","122*15*10",122,15,10,"80-86",369]
["UMKIA2-40",9,66,50,0.6,158,"golf","122*15*10",122,15,10,"60-66",0]
["UMKIR2-40",9,68,50,0.6,159,"golf","122*15*10",122,15,10,"62-68",5]
["UMKIS2-40",9,72,50,0.6,160,"golf","122*15*10",122,15,10,"66-72",0]
["UPCGIAL-43",9,76,50,0.6,161,"golf","122*15*10",122,15,10,"70-76",568]
["UPCGIRS-43",9,79,50,0.6,162,"golf","122*15*10",122,15,10,"73-79",529]
["UPCGWAL-48",9,71,50,0.64,163,"golf","130*15*10",130,15,10,"65-71",159]
["UPCGWRS-48",9,77,50,0.64,164,"golf","130*15*10",130,15,10,"71-77",389]
["UPGLAUNCH33WL-46",9,65,50,0.6,165,"golf","122*15*10",122,15,10,"59-65",39]
["UPGLAUNCH33WR-46",9,67,50,0.6,166,"golf","122*15*10",122,15,10,"61-67",7]
["UPGLAUNCH33WS-46",9,71,50,0.6,167,"golf","122*15*10",122,15,10,"65-71",0]
["UPRLT33WR-46-BLACK",9,65,50,0.6,168,"golf","122*15*10",122,15,10,"59-65",16]
["UPRLT33WR-46-BURG",9,65,50,0.6,169,"golf","122*15*10",122,15,10,"59-65",158]
["UPRLT33WS-46-BLACK",9,67,50,0.6,170,"golf","122*15*10",122,15,10,"61-67",0]
["UPRLT33WS-46-BURG",9,67,50,0.6,171,"golf","122*15*10",122,15,10,"61-67",33]
["UPRLT33WX-46-BLACK",9,67,50,0.6,172,"golf","122*15*10",122,15,10,"63-67",0]
["UPRLT33WX-46-BURG",9,67,50,0.6,173,"golf","122*15*10",122,15,10,"63-67",0]
["UPRLT35WR-46-BLACK",9,68,50,0.6,174,"golf","122*15*10",122,15,10,"62-68",32]
["UPRLT35WR-46-BURG",9,68,50,0.6,175,"golf","122*15*10",122,15,10,"62-68",53]
["UPRLT35WS-46-BLACK",9,68,50,0.6,176,"golf","122*15*10",122,15,10,"62-68",15]
["UPRLT35WS-46-BURG",9,68,50,0.6,177,"golf","122*15*10",122,15,10,"62-68",11]
["UPRLT35WX-46-BLACK",9,71,50,0.6,178,"golf","122*15*10",122,15,10,"65-71",67]
["UPRLT35WX-46-BURG",9,71,50,0.6,179,"golf","122*15*10",122,15,10,"65-71",20]
["UPRLT433WA-46-BLACK",9,61,50,0.6,180,"golf","122*15*10",122,15,10,"55-61",0]
["UPRLT433WR-46-BLACK",9,63,50,0.6,181,"golf","122*15*10",122,15,10,"57-63",0]
["UPRLT433WS-46-BLACK",9,65,50,0.6,182,"golf","122*15*10",122,15,10,"59-65",42]
["UPRLTF33WR-44-BLACK",9,73,50,0.6,183,"golf","122*15*10",122,15,10,"67-73",57]
["UPRLTF33WS-44-BLACK",9,75,50,0.6,184,"golf","122*15*10",122,15,10,"69-75",29]
["UPRLTF33WX-44-BLACK",9,77,50,0.6,185,"golf","122*15*10",122,15,10,"71-77",47]
["UPRLTF35WR-44-BLACK",9,73,50,0.6,186,"golf","122*15*10",122,15,10,"67-73",0]
["UPRLTF35WS-44-BLACK",9,75,50,0.6,187,"golf","122*15*10",122,15,10,"69-75",0]
["UPRLTF35WX-44-BLACK",9,79,50,0.6,188,"golf","122*15*10",122,15,10,"73-79",0]
["UPRLTIR-41",9,80,50,0.6,189,"golf","122*15*10",122,15,10,"74-80",0]
["UPRLTIS-41",9,80,50,0.6,190,"golf","122*15*10",122,15,10,"74-80",0]
["UQPWC-48",9,77,50,0.64,191,"golf","130*15*10",130,15,10,"71-77",27]
["UWFS440WR-45",9,71,50,0.6,192,"golf","122*15*10",122,15,10,"65-71",6]
["UWFS480WR-47",9,69,50,0.6,193,"golf","122*15*10",122,15,10,"63-69",4]
["UWSHG815WR-47",9,69,50,0.6,194,"golf","122*15*10",122,15,10,"63-69",34]
["UWSHG816WR-45",9,71,50,0.6,195,"golf","122*15*10",122,15,10,"65-71",58]
["UWST35DWA-46",9,69,50,0.6,196,"golf","122*15*10",122,15,10,"63-69",0]
["UWST35DWR-46",9,71,50,0.6,197,"golf","122*15*10",122,15,10,"65-71",627]
["UWST35DWS-46",9,74,50,0.6,198,"golf","122*15*10",122,15,10,"68-74",0]
["UWST35DWX-46",9,77,50,0.6,199,"golf","122*15*10",122,15,10,"71-77",0]
["UWST35FWA-44",9,76,50,0.6,200,"golf","122*15*10",122,15,10,"70-76",37]
["UWST35FWR-44",9,77,50,0.6,201,"golf","122*15*10",122,15,10,"71-77",0]
["UWST35FWS-44",9,79,50,0.6,202,"golf","122*15*10",122,15,10,"73-79",0]
["UWST35FWX-44",9,78,50,0.6,203,"golf","122*15*10",122,15,10,"72-78",22]
["UWST43DWA-47",9,65,50,0.6,204,"golf","122*15*10",122,15,10,"59-65",208]
["UWST43DWR-47",9,69,50,0.6,205,"golf","122*15*10",122,15,10,"62-69",230]
["UWST43DWS-47",9,71,50,0.6,206,"golf","122*15*10",122,15,10,"65-71",1154]
["UWST43DWX-47",9,73,50,0.6,207,"golf","122*15*10",122,15,10,"67-73",65]
["WWEFIR2-42",9,84,50,0.6,208,"golf","122*15*10",122,15,10,"76-84",0]
["WWEFWL2-47",9,79,50,0.6,209,"golf","122*15*10",122,15,10,"69-79",0]
["WWPLWA-46",9,63,50,0.6,210,"golf","122*15*10",122,15,10,"59-63",18]
["WWPLWR-46",9,67,50,0.6,211,"golf","122*15*10",122,15,10,"61-67",0]
["WWPLWS-46",9,70,50,0.6,212,"golf","122*15*10",122,15,10,"64-70",0]
["WWTPWIA-42",9,65,50,0.6,213,"golf","122*15*10",122,15,10,"59-65",154]
["WWTPWIL-42",9,65,50,0.6,214,"golf","122*15*10",122,15,10,"59-65",0]
["WWTPWIR-42",9,66,50,0.6,215,"golf","122*15*10",122,15,10,"60-66",0]
["WWTPWIS-42",9,69,50,0.6,216,"golf","122*15*10",122,15,10,"63-69",673]
["WWTPWIW-42",9,69,50,0.6,217,"golf","122*15*10",122,15,10,"63-69",188]
["WWTPWWA-47",9,79,50,0.6,218,"golf","122*15*10",122,15,10,"69-79",0]
["WWTPWWL-47",9,79,50,0.6,219,"golf","122*15*10",122,15,10,"69-79",0]
["WWTPWWR-47",9,79,50,0.6,220,"golf","122*15*10",122,15,10,"69-79",0]
["WWTPWWS-47",9,84,50,0.6,221,"golf","122*15*10",122,15,10,"74-84",1]
["AUCRULRLSWM-46",9,70,50,0.6,222,"golf","122*15*10",122,15,10,{"$error":"#N/A"},11,"Y","Y"]
["SHR-TEN-RF",9,80,60,0.2,223,"tennon","45*26*8",45,26,8,{"$error":"#N/A"},76,"Y"]
["UBLUH633WR-46",9,65,50,0.6,224,"golf","122*15*10",122,15,10,"59－65",0]
["UBLUH633WS-46",9,66,50,0.6,225,"golf","122*15*10",122,15,10,"60-66",0]
["UBLUPNT633WR-46",9,62,50,0.6,226,"golf","122*15*10",122,15,10,"56-62",0]
["UBLUPNT633WS-46",9,66,50,0.6,227,"golf","122*15*10",122,15,10,"60-66",9]
["UBLUPNT633WX-46",9,68,50,0.6,228,"golf","122*15*10",122,15,10,"62-68",0]
["UBLUPNT833WR-46",9,87,50,0.6,229,"golf","122*15*10",122,15,10,"81-87",192]
["UBLUPNT833WS-46",9,89,50,0.6,230,"golf","122*15*10",122,15,10,"83-89",0]
["UBLUPNT833WX-46",9,88,50,0.6,231,"golf","122*15*10",122,15,10,"82-88",0]
["UBROP7033WL-45",9,64,50,0.6,232,"golf","122*15*10",122,15,10,"58－64",119]
["UBROP7033WR-45",9,69,50,0.6,233,"golf","122*15*10",122,15,10,"63－69",0]
["UBROP7033WS-45",9,71,50,0.6,234,"golf","122*15*10",122,15,10,"65－71",127]
["UHPO35WR-46",9,68,50,0.6,235,"golf","122*15*10",122,15,10,"62-68",0]
["UHPO35WS-46",9,69,50,0.6,236,"golf","122*15*10",122,15,10,"63-69",0]
["ULAUNCHHY35WA-41",9,81,50,0.6,237,"golf","122*15*10",122,15,10,"75－81",154]
["ULAUNCHHY35WR-41",9,83,50,0.6,238,"golf","122*15*10",122,15,10,"77－83",73]
["UMK33FWA2-44",9,79,50,0.6,239,"golf","122*15*10",122,15,10,"71-79",63]
["UMK33FWR2-44",9,78,50,0.6,240,"golf","122*15*10",122,15,10,"72-78",121]
["UMK33FWS2-44",9,81,50,0.6,241,"golf","122*15*10",122,15,10,"73-81",157]
["UPGLAUNCH33WA-46",9,65,50,0.6,242,"golf","122*15*10",122,15,10,"59-65",49]
["UPKWA-46",9,67,50,0.6,243,"golf","122*15*10",122,15,10,"61-67",0]
["UPKWR-46",9,70,50,0.6,244,"golf","122*15*10",122,15,10,"64-70",0]
["UPKWS-46",9,73,50,0.6,245,"golf","122*15*10",122,15,10,"67-73",3]
["UQPIC-43",9,85,50,0.6,246,"golf","122*15*10",122,15,10,"77-85",72]
["UQPIL-42",9,84,50,0.6,247,"golf","122*15*10",122,15,10,"76-84",1]
["UQPWL-45",9,64,50,0.6,248,"golf","122*15*10",122,15,10,"58－64",18]
["USP33WR-46",9,67,50,0.6,249,"golf","122*15*10",122,15,10,"61-67",0]
["USPHYIC-43",9,79,50,0.6,250,"golf","122*15*10",122,15,10,"73-79",0]
["BLU85IR-365",9,87,50,0.6,251,"golf","122*15*10",122,15,10,"81-87",0]
["BLU85IR-37",9,87,50,0.6,252,"golf","122*15*10",122,15,10,"81-87",0]
["BLU85IR-375",9,87,50,0.6,253,"golf","122*15*10",122,15,10,"81-87",0]
["BLU85IR-38",9,87,50,0.6,254,"golf","122*15*10",122,15,10,"81-87",0]
["BLU85IR-385",9,87,50,0.6,255,"golf","122*15*10",122,15,10,"81-87",0]
["BLU85IR-39",9,87,50,0.6,256,"golf","122*15*10",122,15,10,"81-87",0]
["BLU85IR-395",9,87,50,0.6,257,"golf","122*15*10",122,15,10,"81-87",0]
["BLU85IR-40",9,87,50,0.6,258,"golf","122*15*10",122,15,10,"81-87",0]
["BLU85IS-375",9,88,50,0.6,259,"golf","122*15*10",122,15,10,"82-88",0]
["BLU85IS-38",9,88,50,0.6,260,"golf","122*15*10",122,15,10,"82-88",0]
["BLU85IS-385",9,88,50,0.6,261,"golf","122*15*10",122,15,10,"82-88",0]
["BLU85IS-39",9,88,50,0.6,262,"golf","122*15*10",122,15,10,"82-88",0]
["BLU85IX-40",9,89,50,0.6,263,"golf","122*15*10",122,15,10,"83-89",0]
["HEX-ELIAS-L-085",9,305,50,null,264,"Shaft","N/A","N/A","N/A","N/A","295-305",0]
["HEX-ELIAS-L-085-G",9,305,50,null,265,"Shaft","N/A","N/A","N/A","N/A","295-305",0]
["HEX-ELIAS-L-100",9,305,50,null,266,"Shaft","N/A","N/A","N/A","N/A","295-305",0]
["HEX-ELIAS-L-100-G",9,305,50,null,267,"Shaft","N/A","N/A","N/A","N/A","295-305",0]
["HEX-ELIAS-R-085",9,305,50,null,268,"Shaft","N/A","N/A","N/A","N/A","295-305",0]
["HEX-ELIAS-R-085-G",9,305,50,null,269,"Shaft","N/A","N/A","N/A","N/A","295-305",0]
["HEX-ELIAS-R-100",9,305,50,null,270,"Shaft","N/A","N/A","N/A","N/A","295-305",0]
["HEX-ELIAS-R-100-G",9,305,50,null,271,"Shaft","N/A","N/A","N/A","N/A","295-305",0]
["HEX-HATCH-L-085",9,305,50,null,272,"Shaft","N/A","N/A","N/A","N/A","295-305",0]
["HEX-HATCH-L-085-G",9,305,50,null,273,"Shaft","N/A","N/A","N/A","N/A","295-305",0]
["HEX-HATCH-L-100",9,305,50,null,274,"Shaft","N/A","N/A","N/A","N/A","295-305",0]
["HEX-HATCH-L-100-G",9,305,50,null,275,"Shaft","N/A","N/A","N/A","N/A","295-305",0]
["HEX-HATCH-R-085",9,305,50,null,276,"Shaft","N/A","N/A","N/A","N/A","295-305",0]
["HEX-HATCH-R-085-G",9,305,50,null,277,"Shaft","N/A","N/A","N/A","N/A","295-305",0]
["HEX-HATCH-R-100",9,305,50,null,278,"Shaft","N/A","N/A","N/A","N/A","295-305",0]
["HEX-HATCH-R-100-G",9,305,50,null,279,"Shaft","N/A","N/A","N/A","N/A","295-305",0]
["HEX-HEW-R-100",9,349.99,50,1.48,280,"shaft","145*29*16",145,29,16,{"$error":"#N/A"},{"$error":"#N/A"},"Y"]
["HEX-HULL-L-085",9,305,50,null,281,"Shaft","N/A","N/A","N/A","N/A","295-305",0]
["HEX-HULL-L-085-G",9,305,50,null,282,"Shaft","N/A","N/A","N/A","N/A","295-305",0]
["HEX-HULL-L-100",9,305,50,null,283,"Shaft","N/A","N/A","N/A","N/A","295-305",0]
["HEX-HULL-R-085",9,305,50,null,284,"Shaft","N/A","N/A","N/A","N/A","295-305",0]
["HEX-HULL-R-085-G",9,305,50,null,285,"Shaft","N/A","N/A","N/A","N/A","295-305",0]
["HEX-HULL-R-100",9,305,50,null,286,"Shaft","N/A","N/A","N/A","N/A","295-305",0]
["HEX-HULL-R-100-G",9,305,50,null,287,"Shaft","N/A","N/A","N/A","N/A","295-305",0]
["HEX-NEW-L-085",9,305,50,null,288,"Shaft","N/A","N/A","N/A","N/A","295-305",0]
["HEX-NEW-L-085-G",9,305,50,null,289,"Shaft","N/A","N/A","N/A","N/A","295-305",0]
["HEX-NEW-L-100",9,305,50,null,290,"Shaft","N/A","N/A","N/A","N/A","295-305",0]
["HEX-NEW-L-100-G",9,305,50,null,291,"Shaft","N/A","N/A","N/A","N/A","295-305",0]
["HEX-NEW-R-085",9,305,50,null,292,"Shaft","N/A","N/A","N/A","N/A","295-305",0]
["HEX-NEW-R-085-G",9,305,50,null,293,"Shaft","N/A","N/A","N/A","N/A","295-305",0]
["HEX-NEW-R-100",9,305,50,null,294,"Shaft","N/A","N/A","N/A","N/A","295-305",0]
["HEX-NEW-R-100-G",9,305,50,null,295,"Shaft","N/A","N/A","N/A","N/A","295-305",0]
["MGUCMTIA-40",9,73,50,0.6,296,"golf","122*15*10",122,15,10,"65-73",114]
["MGUCMTIL-40",9,83,50,0.6,297,"golf","122*15*10",122,15,10,"75－83",324]
["MGUCMTIR-40",9,74,50,0.6,298,"golf","122*15*10",122,15,10,"66-74",67]
["MGUCMTIS-40",9,72,50,0.6,299,"golf","122*15*10",122,15,10,"66-72",157]
["PG11-P06-34",9,90,50,0.6,300,"golf","122*15*10",122,15,10,"84-90",43]
["PG11-P07-34",9,90,50,0.6,301,"golf","122*15*10",122,15,10,"84-90",16]
["PG11-P08-34",9,90,50,0.6,302,"golf","122*15*10",122,15,10,"84-90",12]
["SHR-FF3-10052P",9,326,50,1.48,303,"Shaft","145*29*16",145,29,16,"316-326",0]
["SHR-FF3-11052P",9,326,50,1.48,304,"Shaft","145*29*16",145,29,16,"316-326",0]
["SHR-FF3-12052P",9,315,50,1.48,305,"Shaft","145*29*16",145,29,16,"305-315",369]
["SHR-TF-08552",9,332,50,1.48,306,"Shaft","145*29*16",145,29,16,"318-332",0]
["UBLUPNT635WR-46",9,66,50,0.6,307,"golf","122*15*10",122,15,10,"60-66",19]
["UBLUPNT635WS-46",9,69,50,0.6,308,"golf","122*15*10",122,15,10,"63-69",6]
["UBLUPNT635WX-46",9,67,50,0.6,309,"golf","122*15*10",122,15,10,"61-67",29]
["ULAUNCH145TS",9,79.989999999999995,50,0.6,310,"golf","122*15*10",122,15,10,{"$error":"#N/A"},{"$error":"#N/A"},"Y"]
["ULAUNCHHY35WS-41",9,85,50,0.6,311,"golf","122*15*10",122,15,10,"79－85",77]
["ULAUNCHHY35WX-41",9,88,50,0.6,312,"golf","122*15*10",122,15,10,"81-88",69]
["ULAUNCHSEJW-40",9,61,50,0.6,313,"golf","122*15*10",122,15,10,"55-61",3]
["UPRLT3833WL-45",9,64,50,0.6,314,"golf","122*15*10",122,15,10,"58-64",0]
["UPRLT3833WR-45",9,72,50,0.6,315,"golf","122*15*10",122,15,10,"66-72",0]
["UPRLT3833WS-45",9,74,50,0.6,316,"golf","122*15*10",122,15,10,"68-74",0]
["UPRLTMX2P33WR-46",9,71,25,0.6,317,"golf","122*15*10",122,15,10,"65-71",0]
["UPRLTMX2P33WS-46",9,71,25,0.6,318,"golf","122*15*10",122,15,10,"65-71",0]
["UPRLTMX33WR-46",9,71,50,0.6,319,"golf","122*15*10",122,15,10,"65-71",0]
["UPRLTMX33WS-46",9,71,50,0.6,320,"golf","122*15*10",122,15,10,"65-71",0]
["USP33LWS-46",9,68,50,0.6,321,"golf","122*15*10",122,15,10,"62-68",295]
["BLU85IS-365",9,88,50,0.6,322,"golf","122*15*10",122,15,10,"82-88",0]
["BLU85IS-37",9,88,50,0.6,323,"golf","122*15*10",122,15,10,"82-88",0]
["BLU85IS-395",9,88,50,0.6,324,"golf","122*15*10",122,15,10,"82-88",0]
["BLU85IS-40",9,88,50,0.6,325,"golf","122*15*10",122,15,10,"82-88",0]
["BLU85IX-365",9,89,50,0.6,326,"golf","122*15*10",122,15,10,"83-89",0]
["BLU85IX-37",9,89,50,0.6,327,"golf","122*15*10",122,15,10,"83-89",0]
["BLU85IX-375",9,89,50,0.6,328,"golf","122*15*10",122,15,10,"83-89",0]
["BLU85IX-38",9,89,50,0.6,329,"golf","122*15*10",122,15,10,"83-89",0]
["BLU85IX-385",9,89,50,0.6,330,"golf","122*15*10",122,15,10,"83-89",0]
["BLU85IX-39",9,89,50,0.6,331,"golf","122*15*10",122,15,10,"83-89",0]
["BLU85IX-395",9,89,50,0.6,332,"golf","122*15*10",122,15,10,"83-89",0]
["HEX-ELIAS-L-050",9,248,50,null,333,"Shaft","N/A","N/A","N/A","N/A","232-248",0]
["HEX-ELIAS-R-050",9,248,50,null,334,"Shaft","N/A","N/A","N/A","N/A","232-248",0]
["HEX-HATCH-L-050",9,248,50,null,335,"Shaft","N/A","N/A","N/A","N/A","232-248",0]
["HEX-HATCH-R-050",9,248,50,null,336,"Shaft","N/A","N/A","N/A","N/A","232-248",0]
["SHR-FF3-09052P",9,320,50,1.48,337,"Shaft","145*29*16",145,29,16,"310-320",0]
["TAQEL-1125-ST-OX-70044",9,450,1,0.5,338,"fork1","89*14*9",89,14,9,"450g",0]
["TAQEX-1125-ST-CB-70044",9,430,1,0.5,339,"fork","89*14*9",89,14,9,"430g",0]
["ULAUNCH145TS-46",9,99,50,0.6,340,"golf","122*15*10",122,15,10,"93-99",35]
["ULAUNCHSEJI-37",9,60,50,0.6,341,"golf","122*15*10",122,15,10,"54-60",20]
["UMK33FWX2-44",9,88,50,0.6,342,"golf","122*15*10",122,15,10,"80-88",43]
["UPRLTMX2P33WC-46",9,79.989999999999995,25,0.6,343,"golf","122*15*10",122,15,10,{"$error":"#N/A"},0,"Y"]
["UPTM2TWA-46",9,65,50,0.6,344,"golf","122*15*10",122,15,10,"59－65",115]
["UPTM2TWR-46",9,66,50,0.6,345,"golf","122*15*10",122,15,10,"60-66",70]
["BAL-ULTRA-08052",9,320,50,1.48,346,"Shaft","145*29*16",145,29,16,"310-320",13]
["BAL-ULTRA-09052",9,320,50,1.48,347,"Shaft","145*29*16",145,29,16,"310-320",212]
["BAL-ULTRA-10052",9,320,50,1.48,348,"Shaft","145*29*16",145,29,16,"310-320",183]
["BAL-ULTRA-11052",9,320,50,1.48,349,"Shaft","145*29*16",145,29,16,"310-320",91]
["BLU85IS-405",9,88,50,0.6,350,"golf","122*15*10",122,15,10,"82-88",0]
["BLU85IX-405",9,89,50,0.6,351,"golf","122*15*10",122,15,10,"83-89",0]
["HEX-ELIAS-L-075",9,282,50,null,352,"Shaft","N/A","N/A","N/A","N/A","268-282",0]
["HEX-ELIAS-R-075",9,282,50,null,353,"Shaft","N/A","N/A","N/A","N/A","268-282",0]
["HEX-HATCH-L-075",9,282,50,null,354,"Shaft","N/A","N/A","N/A","N/A","268-282",0]
["HEX-HATCH-R-075",9,282,50,null,355,"Shaft","N/A","N/A","N/A","N/A","268-282",0]
["HEX-HULL-L-050",9,248,50,null,356,"Shaft","N/A","N/A","N/A","N/A","232-248",0]
["HEX-HULL-L-075",9,282,50,null,357,"Shaft","N/A","N/A","N/A","N/A","268-282",0]
["HEX-HULL-R-050",9,248,50,null,358,"Shaft","N/A","N/A","N/A","N/A","232-248",0]
["HEX-HULL-R-075",9,282,50,null,359,"Shaft","N/A","N/A","N/A","N/A","268-282",0]
["SHR-CBY-11048P",9,301,50,1.48,360,"Shaft","145*29*16",145,29,16,"291-301",1]
["UPTM2TWS-46",9,68,50,0.6,361,"golf","122*15*10",122,15,10,"62-68",365]
["BLU85IR-405",9,87,50,0.6,362,"golf","122*15*10",122,15,10,"81-87",0]
["TAQA-1125-ST-CB-70043",9,480,1,0.5,363,"fork","89*14*9",89,14,9,"480g",0]
["TAQS3-1125-ST-CB-70044",9,370,1,0.5,364,"fork","89*14*9",89,14,9,"370g",0]
["TAQZ-1125-ST-CB-70041",9,370,1,0.5,365,"fork","89*14*9",89,14,9,"waiting",0]
["UAGT75WR-45",9,74,50,0.6,366,"golf","122*15*10",122,15,10,"68-74",19]
["ULAUNCH145MTR-46",9,77,50,0.6,367,"golf","122*15*10",122,15,10,"71-77",0]
["UW430PFR-44",9,78,50,0.6,368,"golf","122*15*10",122,15,10,"72-78",216]
["UAGT75WS-45",9,76,50,0.6,369,"golf","122*15*10",122,15,10,"70-76",19]
["UW430PFA-44",9,80,50,0.6,370,"golf","122*15*10",122,15,10,{"$error":"#N/A"},39,"Y","y"]
["AQTB1000-30",9,0,0,null,371,"steer tube",0,0,0,0,{"$error":"#N/A"},0,"Y"]
["AQTB1125-30",9,0,0,null,372,"steer tube",0,0,0,0,{"$error":"#N/A"},0,"Y"]
["AQTB1125-TAN",9,0,0,null,373,"steer tube",0,0,0,0,{"$error":"#N/A"},28,"Y"]
["CCM-VS-09052",9,320,50,1.48,374,"Shaft","145*29*16",145,29,16,"310-320",5]
["HEX-HULL-L-100-G",9,305,50,null,375,"Shaft","N/A","N/A","N/A","N/A","295-305",0]
["TAQZ-1125-ST-CB-70044",9,548,1,0.5,376,"fork","89*14*9",89,14,9,"waiting",0]
["UBLUPNTHY33WR-44",9,75,50,0.6,377,"golf","122*15*10",122,15,10,"69-75",54]
["UBLUPNTHY33WS-44",9,75,50,0.6,378,"golf","122*15*10",122,15,10,"69-75",40]
["ULAUNCHADWS-46",9,70,50,0.6,379,"golf","122*15*10",122,15,10,"64-70",12]
["UWFS4WR-47",9,69,50,0.6,380,"golf","122*15*10",122,15,10,"63-69",6]
["BAL-SQGL-09052",9,335,50,1.48,381,"Shaft","145*29*16",145,29,16,"325-335",5]
["BAL-SQGL-10052",9,341,50,1.48,382,"Shaft","145*29*16",145,29,16,"331-341",6]
["BAL-SQRB-09052",9,320,50,1.48,383,"Shaft","145*29*16",145,29,16,"310-320",2]
["BAL-SQRB-10052",9,326,50,1.48,384,"Shaft","145*29*16",145,29,16,"316-326",12]
["BAL-SQRB-11052",9,326,50,1.48,385,"Shaft","145*29*16",145,29,16,"316-326",8]
["TAQ-1125-ST-CB-70041",9,430,1,0.5,386,"fork","89*14*9",89,14,9,"430g",0]
["TAQ-1125-ST-CB-70044",9,414,1,0.5,387,"fork","89*14*9",89,14,9,"waiting",0]
["TAQ-PLSP-250",9,135,8,0.2,388,"Seat Post","45*26*8",45,26,8,"130 ± 5g",0]
["TAQ-PLSP-350",9,165,8,0.2,389,"Seat Post","45*26*8",45,26,8,"160 ± 5g",0]
["TAQS3-100-ST-CB-70044",9,430,1,0.5,390,"fork","89*14*9",89,14,9,"waiting",0]
["TAQS3-1125-ST-CB-7004",9,499.99,1,0.5,391,"fork","89*14*9",89,14,9,{"$error":"#N/A"},{"$error":"#N/A"},"Y"]
["TAQS3-1125-ST-CB-70041",9,370,1,0.5,392,"fork","89*14*9",89,14,9,"370g",0]
["ULAUNCHADWR-46",9,70,50,0.6,393,"golf","122*15*10",122,15,10,"64-70",58]
["AQTB1125-TANZ",9,0,0,null,394,"steer tube",0,0,0,0,{"$error":"#N/A"},79,"Y"]
["UDA05GWC-48",9,77,50,0.64,395,"golf","130*15*10",130,15,10,"71-77",0]
["TAQ-100-ST-CB-70044",9,370,1,0.5,396,"fork","89*14*9",89,14,9,"waiting",0]
["TAQ-1125-TN-CB-70041",9,443,1,0.5,397,"fork","89*14*9",89,14,9,"waiting",0]
["TAQ-1125-TN-CB-70044",9,490,1,0.5,398,"fork","89*14*9",89,14,9,"waiting",0]
["TAQEX-100-ST-CB-70044",9,375,1,0.5,399,"fork","89*14*9",89,14,9,"375g",0]
["TAQS3-100-ST-CB-70044-UP",9,377,25,2.54,400,"fork","77*52*32",77,52,32,"waiting",0]
["UDA05GIC-43",9,85,50,0.6,401,"golf","122*15*10",122,15,10,"77-85",0]
["BAL-SQGL-08052",9,320,50,1.48,402,"Shaft","145*29*16",145,29,16,"310-320",3]
["BAL-SQGL-11052",9,341,50,1.48,403,"Shaft","145*29*16",145,29,16,"331-341",21]
["TAQA-1125-ST-CB-70043-GL",9,375,1,0.5,404,"fork","89*14*9",89,14,9,"375g",0]
["UBLUPNTHY33WX-44",9,75,50,0.6,405,"golf","122*15*10",122,15,10,"69-75",13]
["ULAUNCH145MTS-46",9,77,50,0.6,406,"golf","122*15*10",122,15,10,"71-77",0]
["TFC100IR-10-355",9,77.5,100,0.64,407,"golf","105*25*11",105,25,11,"71.5-77.5",1279]
["TFC100IR-1-40",9,87.2,100,0.64,408,"golf","105*25*11",105,25,11,"81.2-87.2",0]
["TFC100IR-2-395",9,85.2,100,0.64,409,"golf","105*25*11",105,25,11,"79.2-85.2",20]
["TFC100IR-3-39",9,85.1,100,0.64,410,"golf","105*25*11",105,25,11,"79.1-85.1",107]
["TFC100IR-4-385",9,85.9,100,0.64,411,"golf","105*25*11",105,25,11,"79.9-85.9",0]
["TFC100IR-5-38",9,84,100,0.64,412,"golf","105*25*11",105,25,11,"78-84",5]
["TFC100IR-6-375",9,81.3,100,0.64,413,"golf","105*25*11",105,25,11,"75.3-81.3",3]
["TFC100IR-7-37",9,81.599999999999994,100,0.64,414,"golf","105*25*11",105,25,11,"75.6-81.6",12]
["TFC100IR-8-365",9,79.2,100,0.64,415,"golf","105*25*11",105,25,11,"73.2-79.2",125]
["TFC100IR-9-36",9,78.099999999999994,100,0.64,416,"golf","105*25*11",105,25,11,"72.1-78.1",65]
["TFC100IS-10-355",9,88,100,0.64,417,"golf","105*25*11",105,25,11,"82-88",620]
["TFC100IS-1-40",9,96.1,100,0.64,418,"golf","105*25*11",105,25,11,"90.1-96.1",2]
["TFC100IS-2-395",9,94.4,100,0.64,419,"golf","105*25*11",105,25,11,"88.4-94.4",20]
["TFC100IS-3-39",9,93.5,100,0.64,420,"golf","105*25*11",105,25,11,"87.5-93.5",700]
["TFC100IS-4-385",9,93.4,100,0.64,421,"golf","105*25*11",105,25,11,"87.4-93.4",610]
["TFC100IS-5-38",9,91.9,100,0.64,422,"golf","105*25*11",105,25,11,"85.9-91.9",966]
["TFC100IS-6-375",9,90.6,100,0.64,423,"golf","105*25*11",105,25,11,"84.6-90.6",1212]
["TFC100IS-7-37",9,89.5,100,0.64,424,"golf","105*25*11",105,25,11,"83.5-89.5",898]
["TFC100IS-8-365",9,89.3,100,0.64,425,"golf","105*25*11",105,25,11,"83.3-89.3",1155]
["TFC100IS-9-36",9,85.9,100,0.64,426,"golf","105*25*11",105,25,11,"79.9-85.9",694]
["UWTP480DWR-47",9,69,50,0.6,427,"golf","122*15*10",122,15,10,"63-69",0]
["TFC100IA-1-40",9,77,100,0.64,428,"golf","105*25*11",105,25,11,"71-77",42]
["SHR-COMP-09563",9,323,50,1.6,429,"Shaft","183*29*16",183,29,16,"309-323",69]
["TAQA-1125-ST-CB-70043-UP",9,375,25,2.54,430,"fork","77*52*32",77,52,32,"waiting",0]
["UWNANO2635DWR-46",9,65,50,0.6,431,"golf","122*15*10",122,15,10,"59-65",8]
["UWNANO2635DWS-46",9,67,50,0.6,432,"golf","122*15*10",122,15,10,"61-67",0]
["UWNANO2FW3R-44",9,77,50,0.6,433,"golf","122*15*10",122,15,10,"71-77",30]
["UWNANO2FW3S-44",9,79,50,0.6,434,"golf","122*15*10",122,15,10,"73-79",89]
["UWTP428FWR-45",9,71,50,0.6,435,"golf","122*15*10",122,15,10,"65-71",66]
["UWNANO2635DWA-46",9,65,50,0.6,436,"golf","122*15*10",122,15,10,"59-65",0]
["UWNANO2FW3A-44",9,76,50,0.6,437,"golf","122*15*10",122,15,10,"70-76",33]
["UWNANO2FW579A-43",9,76,50,0.6,438,"golf","122*15*10",122,15,10,"70-76",0]
["UWNANO2FW579R-43",9,77,50,0.6,439,"golf","122*15*10",122,15,10,"71-77",41]
["TAQ-1125-TN-CB-70044-UP",9,490,25,2.54,440,"fork","77*52*32",77,52,32,"waiting",0]
["TAQS3-1125-IH-ST-CB-70044",9,380,1,0.5,441,"fork","89*14*9",89,14,9,"380g",0]
["UWNANO2635DWX-46",9,69,50,0.6,442,"golf","122*15*10",122,15,10,"63-69",50]
["UWNANO2FW3X-44",9,77,50,0.6,443,"golf","122*15*10",122,15,10,"71-77",242]
["PASS-TI-09051",9,315,50,1.48,444,"Shaft","145*29*16",145,29,16,"301-315",125]
["PASS-TI-10051",9,323,50,1.48,445,"Shaft","145*29*16",145,29,16,"309-323",0]
["PASS-TI-11051",9,330,50,1.48,446,"Shaft","145*29*16",145,29,16,"316-330",61]
["PASS-TI-12051",9,328,50,1.48,447,"Shaft","145*29*16",145,29,16,"314-328",67]
["TAQ-1125-IH-ST-CB-70044",9,435,1,0.5,448,"fork","89*14*9",89,14,9,"435g",0]
["UWFS3WR-F-44",9,67,50,0.6,449,"golf","122*15*10",122,15,10,"61-67",30]
["UWFS3WS-F-44",9,69,50,0.6,450,"golf","122*15*10",122,15,10,"62-69",28]
["AUPL-76-WR-46",9,67,50,0.6,451,"golf","122*15*10",122,15,10,"61-67",0]
["MGBGS3-45",9,81,50,0.6,452,"golf","122*15*10",122,15,10,"71-81",33]
["TAQEX-1125-IH-ST-CB-70044",9,430,1,0.5,453,"fork","89*14*9",89,14,9,"430g",0]
["UW430PDR-47",9,69,50,0.6,454,"golf","122*15*10",122,15,10,"63-69",71]
["UW430PDS-47",9,72,50,0.6,455,"golf","122*15*10",122,15,10,"65-72",37]
["UWFS3WA-47",9,60,50,0.6,456,"golf","122*15*10",122,15,10,"54-60",225]
["UWFS4WR-47-NC",9,69,50,0.6,457,"golf","122*15*10",122,15,10,"63-69",17]
["UWFS4WS-47",9,69,50,0.6,458,"golf","122*15*10",122,15,10,"63-69",1]
["UWNANO2FW579S-43",9,79,50,0.6,459,"golf","122*15*10",122,15,10,"73-79",0]
["UWNANO2FW579X-43",9,77,50,0.6,460,"golf","122*15*10",122,15,10,"71-77",5]
["UNZ633WR-46",9,67,50,0.6,461,"golf","122*15*10",122,15,10,"61-67",0]
["UNZ633WS-46",9,68,50,0.6,462,"golf","122*15*10",122,15,10,"62-68",0]
["UNZ633WX-46",9,91,50,0.6,463,"golf","122*15*10",122,15,10,"75-91",0]
["UWFS4WS-47-NC",9,67,50,0.6,464,"golf","122*15*10",122,15,10,"61-67",2]
["UWFS3WS-47",9,64,50,0.6,465,"golf","122*15*10",122,15,10,"58-64",76]
["UTEJMQL33WL-46",9,64,50,0.6,466,"golf","122*15*10",122,15,10,"58－64",128]
["UTEJMQL33WR-46",9,72,50,0.6,467,"golf","122*15*10",122,15,10,"66-72",27]
["UTEJMQL33WS-46",9,74,50,0.6,468,"golf","122*15*10",122,15,10,"68-74",278]
["UADA2OSHYIR-42",9,79,100,0.72,469,"golf","111*29*10",111,29,10,"73-79",10]
["UADA2OSHYIS-42",9,79,100,0.72,470,"golf","111*29*10",111,29,10,"73-79",2]
["UADA2OSIR-41",9,76,100,0.72,471,"golf","111*29*10",111,29,10,"70-76",7]
["UADA2OSIS-41",9,76,100,0.72,472,"golf","111*29*10",111,29,10,"70-76",225]
["UADA2OSIW-405",9,76,100,0.72,473,"golf","111*29*10",111,29,10,"70-76",131]
["UTEJMQL33WA-46",9,68,50,0.6,474,"golf","122*15*10",122,15,10,"62-68",58]
["UTEJMQL33WX-46",9,76,50,0.6,475,"golf","122*15*10",122,15,10,"70-76",25]
["UWFS3WR-47",9,60,50,0.6,476,"golf","122*15*10",122,15,10,"54-60",0]
["SHR-MOM-S03L",9,155,6,0.2,477,"blade","45*26*8",45,26,8,"145-155",0]
["SHR-MOM-S03R",9,155,6,0.2,478,"blade","45*26*8",45,26,8,"145-155",0]
["SHR-MOM-S04L",9,155,6,0.2,479,"blade","45*26*8",45,26,8,"145-155",0]
["SHR-MOM-S04R",9,155,6,0.2,480,"blade","45*26*8",45,26,8,"145-155",0]
["SHR-MOM-S07L",9,155,6,0.2,481,"blade","45*26*8",45,26,8,"145-155",0]
["SHR-MOM-S07R",9,155,6,0.2,482,"blade","45*26*8",45,26,8,"145-155",0]
["ULAUNCHMDWR-46",9,67,50,0.6,483,"golf","122*15*10",122,15,10,"61-67",23]
["ULAUNCHMDWS-46",9,68,50,0.6,484,"golf","122*15*10",122,15,10,"62-68",26]
["UMDPL65WR-46",9,69,50,0.6,487,"golf","122*15*10",122,15,10,"63－69",0]
["UMDPL65WS-46",9,71,50,0.6,488,"golf","122*15*10",122,15,10,"65－71",8]
["UPRLTWR-46-MD",9,72,50,0.6,489,"golf","122*15*10",122,15,10,"66-72",6]
["UPRLTWS-46-MD",9,74,50,0.6,490,"golf","122*15*10",122,15,10,"68-74",0]
["SHR-MOM-S05L",9,155,6,0.2,491,"blade","45*26*8",45,26,8,"145-155",0]
["SHR-MOM-S05R",9,155,6,0.2,492,"blade","45*26*8",45,26,8,"145-155",0]
["ULAUNCHHYMDIR-41",9,87,50,0.6,493,"golf","122*15*10",122,15,10,"81-87",57]
["ULAUNCHHYMDIS-41",9,91,50,0.6,494,"golf","122*15*10",122,15,10,"85-91",95]
["QTS20-8-743",9,483,1,0.5,495,"fork","89*14*9",89,14,9,"483g",41]
["SHR-MOM-S06L",9,155,6,0.2,496,"blade","45*26*8",45,26,8,"145-155",0]
["SHR-MOM-S06R",9,155,6,0.2,497,"blade","45*26*8",45,26,8,"145-155",0]
["BAL-ULTRA-S03L-M-UP",9,155,160,1.7,498,"blade","72*52*32",72,52,32,"145-155",41]
["BAL-ULTRA-S03R-M-UP",9,155,160,1.7,499,"blade","72*52*32",72,52,32,"145-155",1]
["BAL-ULTRA-S05L-M-UP",9,160,160,1.7,500,"blade","72*52*32",72,52,32,"150-160",136]
["BAL-ULTRA-S05R-M-UP",9,160,160,1.7,501,"blade","72*52*32",72,52,32,"150-160",66]
["BAL-ULTRA-S06L-H-08060",9,475,25,1.6,502,"hockey","183*29*16",183,29,16,"310-320",0]
["BAL-ULTRA-S06L-M-UP",9,155,160,1.7,503,"blade","72*52*32",72,52,32,"145-155",0]
["BAL-ULTRA-S06R-H-08060",9,475,25,1.6,504,"hockey","183*29*16",183,29,16,"310-320",0]
["BAL-ULTRA-S06R-M-UP",9,155,160,1.7,505,"blade","72*52*32",72,52,32,"145-155",0]
["ULAUNCHHYMDIL-41",9,79,50,0.6,506,"golf","122*15*10",122,15,10,"73-79",37]
["ULAUNCH833WS-46",9,89,50,0.6,507,"golf","122*15*10",122,15,10,"83-89",27]
["HEX-ELIAS-L-050-G",9,248,50,null,508,"Shaft","N/A","N/A","N/A","N/A","232-248",0]
["HEX-ELIAS-L-075-G",9,282,50,null,509,"Shaft","N/A","N/A","N/A","N/A","268-282",0]
["HEX-HULL-L-050-G",9,248,50,null,510,"Shaft","N/A","N/A","N/A","N/A","232-248",0]
["TTS-STDSQ-08548P",9,291,50,1.48,511,"shaft","145*29*16",145,29,16,"281-291",0]
["TTS-STDSQ-10048P",9,301,50,1.48,512,"shaft","145*29*16",145,29,16,"291-301",0]
["TTS-STDSQ-11048P",9,301,50,1.48,513,"shaft","145*29*16",145,29,16,"291-301",0]
["TTS-STDSQ-12048P",9,291,50,1.48,514,"shaft","145*29*16",145,29,16,"281-291",0]
["TTS-STDSQ-14048P",9,306,50,1.48,515,"shaft","145*29*16",145,29,16,"296-306",0]
["BAL-ULTRA-S03L-H-08060",9,475,25,1.6,516,"hockey","183*29*16",183,29,16,"310-320",0]
["BAL-ULTRA-S03R-H-08060",9,475,25,1.6,517,"hockey","183*29*16",183,29,16,"310-320",0]
["BAL-ULTRA-S06L-H-09060",9,475,25,1.6,518,"hockey","183*29*16",183,29,16,"310-320",0]
["BAL-ULTRA-S06R-H-09060",9,475,25,1.6,519,"hockey","183*29*16",183,29,16,"310-320",0]
["BAL-ULTRA-S03R-H-09060",9,475,25,1.6,520,"hockey","183*29*16",183,29,16,"310-320",0]
["BAL-ULTRA-S05L-H-08060",9,475,25,1.6,521,"hockey","183*29*16",183,29,16,"310-320",0]
["BAL-ULTRA-S05R-H-08060",9,475,25,1.6,522,"hockey","183*29*16",183,29,16,"310-320",0]
["BAL-ULTRA-S03L-H-09060",9,475,25,1.6,523,"hockey","183*29*16",183,29,16,"310-320",0]
["BAL-ULTRA-S03L-H-10060",9,475,25,1.6,524,"hockey","183*29*16",183,29,16,"310-320",0]
["BAL-ULTRA-S03L-H-11060",9,475,25,1.6,525,"hockey","183*29*16",183,29,16,"310-320",0]
["BAL-ULTRA-S03L-M-08060",9,475,25,1.6,526,"hockey","183*29*16",183,29,16,"310-320",0]
["BAL-ULTRA-S03L-M-09060",9,490,25,1.6,527,"hockey","183*29*16",183,29,16,"325-335",0]
["BAL-ULTRA-S03L-M-10060",9,496,25,1.6,528,"hockey","183*29*16",183,29,16,"331-341",0]
["BAL-ULTRA-S03L-M-11060",9,496,25,1.6,529,"hockey","183*29*16",183,29,16,"331-341",0]
["BAL-ULTRA-S03R-H-10060",9,475,25,1.6,530,"hockey","183*29*16",183,29,16,"310-320",0]
["BAL-ULTRA-S03R-H-11060",9,475,25,1.6,531,"hockey","183*29*16",183,29,16,"310-320",0]
["BAL-ULTRA-S03R-M-08060",9,475,25,1.6,532,"hockey","183*29*16",183,29,16,"310-320",0]
["BAL-ULTRA-S03R-M-09060",9,490,25,1.6,533,"hockey","183*29*16",183,29,16,"325-335",0]
["BAL-ULTRA-S03R-M-10060",9,496,25,1.6,534,"hockey","183*29*16",183,29,16,"331-341",0]
["BAL-ULTRA-S03R-M-11060",9,496,25,1.6,535,"hockey","183*29*16",183,29,16,"331-341",0]
["BAL-ULTRA-S05L-H-09060",9,475,25,1.6,536,"hockey","183*29*16",183,29,16,"310-320",0]
["BAL-ULTRA-S05L-H-10060",9,475,25,1.6,537,"hockey","183*29*16",183,29,16,"310-320",0]
["BAL-ULTRA-S05L-H-11060",9,475,25,1.6,538,"hockey","183*29*16",183,29,16,"310-320",0]
["BAL-ULTRA-S05L-M-08060",9,475,25,1.6,539,"hockey","183*29*16",183,29,16,"310-320",0]
["BAL-ULTRA-S05L-M-09060",9,490,25,1.6,540,"hockey","183*29*16",183,29,16,"325-335",0]
["BAL-ULTRA-S05L-M-10060",9,496,25,1.6,541,"hockey","183*29*16",183,29,16,"331-341",0]
["BAL-ULTRA-S05L-M-11060",9,496,25,1.6,542,"hockey","183*29*16",183,29,16,"331-341",0]
["BAL-ULTRA-S05R-H-09060",9,475,25,1.6,543,"hockey","183*29*16",183,29,16,"310-320",0]
["BAL-ULTRA-S05R-H-10060",9,475,25,1.6,544,"hockey","183*29*16",183,29,16,"310-320",0]
["BAL-ULTRA-S05R-H-11060",9,475,25,1.6,545,"hockey","183*29*16",183,29,16,"310-320",0]
["BAL-ULTRA-S05R-M-08060",9,475,25,1.6,546,"hockey","183*29*16",183,29,16,"310-320",0]
["BAL-ULTRA-S05R-M-09060",9,490,25,1.6,547,"hockey","183*29*16",183,29,16,"325-335",0]
["BAL-ULTRA-S05R-M-10060",9,496,25,1.6,548,"hockey","183*29*16",183,29,16,"331-341",0]
["BAL-ULTRA-S05R-M-11060",9,496,25,1.6,549,"hockey","183*29*16",183,29,16,"331-341",0]
["BAL-ULTRA-S06L-H-10060",9,475,25,1.6,550,"hockey","183*29*16",183,29,16,"310-320",0]
["BAL-ULTRA-S06L-H-11060",9,475,25,1.6,551,"hockey","183*29*16",183,29,16,"310-320",0]
["BAL-ULTRA-S06L-M-08060",9,475,25,1.6,552,"hockey","183*29*16",183,29,16,"310-320",0]
["BAL-ULTRA-S06L-M-09060",9,490,25,1.6,553,"hockey","183*29*16",183,29,16,"325-335",0]
["BAL-ULTRA-S06L-M-10060",9,496,25,1.6,554,"hockey","183*29*16",183,29,16,"331-341",0]
["BAL-ULTRA-S06L-M-11060",9,496,25,1.6,555,"hockey","183*29*16",183,29,16,"331-341",0]
["BAL-ULTRA-S06R-H-10060",9,475,25,1.6,556,"hockey","183*29*16",183,29,16,"310-320",0]
["BAL-ULTRA-S06R-H-11060",9,475,25,1.6,557,"hockey","183*29*16",183,29,16,"310-320",0]
["BAL-ULTRA-S06R-M-08060",9,475,25,1.6,558,"hockey","183*29*16",183,29,16,"310-320",0]
["BAL-ULTRA-S06R-M-09060",9,490,25,1.6,559,"hockey","183*29*16",183,29,16,"325-335",0]
["BAL-ULTRA-S06R-M-10060",9,496,25,1.6,560,"hockey","183*29*16",183,29,16,"331-341",0]
["BAL-ULTRA-S06R-M-11060",9,496,25,1.6,561,"hockey","183*29*16",183,29,16,"331-341",0]
["BAL-ULTRA-SO3R-H-10060",9,499.99,25,1.6,562,"hockey","183*29*16",183,29,16,{"$error":"#N/A"},{"$error":"#N/A"},"Y"]
["BAL-ULTRA-SO6L-H-10060",9,499.99,25,1.6,563,"hockey","183*29*16",183,29,16,{"$error":"#N/A"},{"$error":"#N/A"},"Y"]
["SHR-XD-10552P",9,339,50,1.48,564,"Shaft","145*29*16",145,29,16,"325-339",8]
["UBLUPNT835WR-46",9,87,50,0.6,565,"golf","122*15*10",122,15,10,"81-87",0]
["UPMP65WR-46",9,69,50,0.6,566,"golf","122*15*10",122,15,10,"63-69",28]
["UPMP65WS-46",9,69,50,0.6,567,"golf","122*15*10",122,15,10,"63-69",0]
["UPMTWS-46",9,77,50,0.6,568,"golf","122*15*10",122,15,10,"71-77",0]
["UPMTWX-46",9,78,50,0.6,569,"golf","122*15*10",122,15,10,"72-78",0]
["UPMXD60WR-46",9,63,50,0.6,570,"golf","122*15*10",122,15,10,"57-63",0]
["UPMXD60WS-46",9,65,50,0.6,571,"golf","122*15*10",122,15,10,"59-65",0]
["QZ-8-744",9,535,1,0.5,572,"fork","89*14*9",89,14,9,"535g",1,{"$f":"VLOOKUP(A:A,[2]成品数据统计表!$C$1:$E$65536,3,0)","v":{"$error":"#REF!"}}]
["SHR-XD-08552P",9,332,50,1.48,573,"Shaft","145*29*16",145,29,16,"318-332",16]
["SHR-XD-09552P",9,329,50,1.48,574,"Shaft","145*29*16",145,29,16,"315-329",4]
["BAL-ULTRA-S03L-M",9,155,6,0.2,575,"blade","45*26*8",45,26,8,"145-155",14]
["BAL-ULTRA-S03R-M",9,155,6,0.2,576,"blade","45*26*8",45,26,8,"145-155",0]
["BAL-ULTRA-S05L-M",9,160,6,0.2,577,"blade","45*26*8",45,26,8,"150-160",19]
["BAL-ULTRA-S05R-M",9,160,6,0.2,578,"blade","45*26*8",45,26,8,"150-160",0]
["BAL-ULTRA-S06L-M",9,155,6,0.2,579,"blade","45*26*8",45,26,8,"145-155",0]
["BAL-ULTRA-S06R-M",9,155,6,0.2,580,"blade","45*26*8",45,26,8,"145-155",0]
["QCOMPS10-8-744",9,515,1,0.5,581,"fork1","89*14*9",89,14,9,"515g",0]
["QGS10-8H-744",9,382,1,0.5,582,"fork","89*14*9",89,14,9,"382g",56]
["RHN-EVO-S03L-H-10060-SB",9,475,25,1.6,583,"hockey","183*29*16",183,29,16,"310-320",0]
["RHN-EVO-S03L-M",9,155,6,0.2,584,"blade","45*26*8",45,26,8,{"$error":"#N/A"},0,"Y"]
["RHN-EVO-S03L-M-10060-BY",9,496,25,1.6,585,"hockey","183*29*16",183,29,16,"331-341",10]
["RHN-EVO-S03R-M-10060-BY",9,496,25,1.6,586,"hockey","183*29*16",183,29,16,"331-341",10]
["RHN-EVO-S03R-M-10060-WB",9,496,25,1.6,587,"hockey","183*29*16",183,29,16,"331-341",3]
["RHN-EVO-S07L-H-10060-SB",9,475,25,1.6,588,"hockey","183*29*16",183,29,16,"310-320",0]
["RHN-EVO-S07L-M-10060-WB",9,496,25,1.6,589,"hockey","183*29*16",183,29,16,"331-341",0]
["RHN-EVO-S07R-M-10060-WB",9,496,25,1.6,590,"hockey","183*29*16",183,29,16,"331-341",0]
["SHR-COMP-10563",9,323,50,1.6,591,"Shaft","183*29*16",183,29,16,"309-323",0]
["BAL-ULTRA-S03L-H",9,143,6,0.2,592,"blade","45*26*8",45,26,8,"133-143",3]
["BAL-ULTRA-S03R-H",9,143,6,0.2,593,"blade","45*26*8",45,26,8,"133-143",14]
["BAL-ULTRA-S05L-H",9,147,6,0.2,594,"blade","45*26*8",45,26,8,"137-147",51]
["BAL-ULTRA-S05R-H",9,147,6,0.2,595,"blade","45*26*8",45,26,8,"137-147",0]
["BAL-ULTRA-S06L-H",9,145,6,0.2,596,"blade","45*26*8",45,26,8,"135-145",0]
["BAL-ULTRA-S06R-H",9,145,6,0.2,597,"blade","45*26*8",45,26,8,"135-145",0]
["QCOMPS20-8H-744-KHS",9,430,1,0.5,598,"fork","89*14*9",89,14,9,"433g",0]
["RHN-EVO-S03L-M-10060",9,496,25,1.6,599,"hockey","183*29*16",183,29,16,"331-341",0]
["RHN-EVO-S03L-M-10060-WB",9,496,25,1.6,600,"hockey","183*29*16",183,29,16,"331-341",1]
["RHN-EVO-S03R-M",9,155,6,0.2,601,"blade","45*26*8",45,26,8,{"$error":"#N/A"},0,"Y"]
["RHN-EVO-S03R-M-10060",9,496,25,1.6,602,"hockey","183*29*16",183,29,16,"331-341",0]
["RHN-EVO-S05L-H-10060-SB",9,475,25,1.6,603,"hockey","183*29*16",183,29,16,"310-320",0]
["RHN-EVO-S05L-M",9,155,6,0.2,604,"blade","45*26*8",45,26,8,"145-155",0]
["RHN-EVO-S05L-M-10060",9,496,25,1.6,605,"hockey","183*29*16",183,29,16,"331-341",0]
["RHN-EVO-S05L-M-10060-WB",9,496,25,1.6,606,"hockey","183*29*16",183,29,16,"331-341",0]
["RHN-EVO-S05R-M",9,155,6,0.2,607,"blade","45*26*8",45,26,8,{"$error":"#N/A"},0,"Y"]
["RHN-EVO-S05R-M-10060",9,496,25,1.6,608,"hockey","183*29*16",183,29,16,"331-341",0]
["RHN-EVO-S06L-H-10060-SB",9,475,25,1.6,609,"hockey","183*29*16",183,29,16,"310-320",0]
["RHN-EVO-S06L-M",9,155,6,0.2,610,"blade","45*26*8",45,26,8,{"$error":"#N/A"},0,"Y"]
["RHN-EVO-S06L-M-10060",9,496,25,1.6,611,"hockey","183*29*16",183,29,16,"331-341",0]
["RHN-EVO-S06L-M-10060-BY",9,496,25,1.6,612,"hockey","183*29*16",183,29,16,"331-341",9]
["RHN-EVO-S06L-M-10060-WB",9,496,25,1.6,613,"hockey","183*29*16",183,29,16,"331-341",0]
["RHN-EVO-S06R-M",9,155,6,0.2,614,"blade","45*26*8",45,26,8,{"$error":"#N/A"},0,"Y"]
["RHN-EVO-S06R-M-10060",9,496,25,1.6,615,"hockey","183*29*16",183,29,16,"331-341",0]
["RHN-EVO-S06R-M-10060-BY",9,496,25,1.6,616,"hockey","183*29*16",183,29,16,"331-341",10]
["RHN-EVO-S06R-M-10060-WB",9,496,25,1.6,617,"hockey","183*29*16",183,29,16,"331-341",0]
["RHN-EVO-S07L-M",9,155,6,0.2,618,"blade","45*26*8",45,26,8,"145-155",0]
["RHN-EVO-S07L-M-10060",9,496,25,1.6,619,"hockey","183*29*16",183,29,16,"331-341",0]
["RHN-EVO-S07R-M",9,155,6,0.2,620,"blade","45*26*8",45,26,8,"145-155",0]
["RHN-EVO-S07R-M-10060",9,496,25,1.6,621,"hockey","183*29*16",183,29,16,"331-341",0]
["UBLUCNOTEIX-41",9,111,50,0.6,622,"golf","122*15*10",122,15,10,"105-111",0]
["UPRLTWL-46-MD",9,65,50,0.6,623,"golf","122*15*10",122,15,10,"59-65",37]
["AQTB1125LT-26",9,0,0,null,624,"steer tube",0,0,0,0,{"$error":"#N/A"},288,"Y"]
["QCOMPS10-8H-744",9,525,1,0.5,625,"fork1","89*14*9",89,14,9,"525g",2]
["RHN-EVO-S03R-H-10060-SB",9,475,25,1.6,626,"hockey","183*29*16",183,29,16,"310-320",2]
["SHR-MOM-S07L-M",9,155,6,0.2,627,"blade","45*26*8",45,26,8,{"$error":"#N/A"},0,"Y"]
["QCOMPS20-1-744",9,385,1,0.5,628,"fork","89*14*9",89,14,9,"385g",2,{"$f":"VLOOKUP(A:A,[2]成品数据统计表!$C$1:$E$65536,3,0)","v":{"$error":"#REF!"}}]
["QCOMPS20-8-744",9,423,1,0.5,629,"fork","89*14*9",89,14,9,"423g",1]
["RHN-EVO-H-SF-10060",9,460,25,1.6,630,"hockey","183*29*16",183,29,16,"295-305",0]
["RHN-EVO-M-SF-10060",9,481,25,1.6,631,"hockey","183*29*16",183,29,16,"316-326",0]
["RHN-EVO-M-SF-10060-BY",9,481,25,1.6,632,"hockey","183*29*16",183,29,16,"316-326",0]
["QGS10-8-744",9,367,1,0.5,633,"fork","89*14*9",89,14,9,"367g",6]
["QWOLFSL-8-743",9,355,25,2.54,634,"fork","72*52*32",72,52,32,"355g",22,{"$f":"VLOOKUP(A:A,[2]成品数据统计表!$C$1:$E$65536,3,0)","v":{"$error":"#REF!"}}]
["QGS10-1-744",9,345,1,0.5,636,"fork","89*14*9",89,14,9,"352g",0,{"$f":"VLOOKUP(A:A,[2]成品数据统计表!$C$1:$E$65536,3,0)","v":{"$error":"#REF!"}}]
["UBRX35DA-46",9,80,50,0.6,637,"golf","122*15*10",122,15,10,{"$error":"#N/A"},0,"Y"]
["UBRX35DR-46",9,80,50,0.6,638,"golf","122*15*10",122,15,10,{"$error":"#N/A"},0,"Y"]
["UBRX35DS-46",9,80,50,0.6,639,"golf","122*15*10",122,15,10,{"$error":"#N/A"},0,"Y"]
["UBRX35DX-46",9,80,50,0.6,640,"golf","122*15*10",122,15,10,{"$error":"#N/A"},2,"Y"]
["UBRX35FA-44",9,80,50,0.6,641,"golf","122*15*10",122,15,10,{"$error":"#N/A"},15,"Y"]
["UBRX35FR-44",9,80,50,0.6,642,"golf","122*15*10",122,15,10,{"$error":"#N/A"},22,"Y"]
["UBRX35FS-44",9,80,50,0.6,643,"golf","122*15*10",122,15,10,{"$error":"#N/A"},61,"Y"]
["UBRX35FX-44",9,80,50,0.6,644,"golf","122*15*10",122,15,10,{"$error":"#N/A"},0,"Y"]
["UBRX848DR-46",9,80,50,0.6,645,"golf","122*15*10",122,15,10,{"$error":"#N/A"},0,"Y"]
["UBRX848DS-46",9,80,50,0.6,646,"golf","122*15*10",122,15,10,{"$error":"#N/A"},0,"Y"]
["UBRXDA-46",9,80,50,0.6,647,"golf","122*15*10",122,15,10,{"$error":"#N/A"},0,"Y"]
["UBRXDS-46",9,80,50,0.6,648,"golf","122*15*10",122,15,10,{"$error":"#N/A"},0,"Y"]
["UBRXDX-46",9,80,50,0.6,649,"golf","122*15*10",122,15,10,{"$error":"#N/A"},0,"Y"]
["UBRXFA-44",9,80,50,0.6,650,"golf","122*15*10",122,15,10,{"$error":"#N/A"},0,"Y"]
["UBRXFX-44",9,80,50,0.6,651,"golf","122*15*10",122,15,10,{"$error":"#N/A"},0,"Y"]
["UBRXFX-46",9,80,50,0.6,652,"golf","122*15*10",122,15,10,{"$error":"#N/A"},0,"Y"]
["UPCCLUB35IR-42",9,69,50,0.6,653,"golf","122*15*10",122,15,10,"63-69",0]
["QZ-8-741",9,535,1,0.5,655,"fork","89*14*9",89,14,9,"535g",0]
["UBLUPROTOJDWX-46",9,91,50,0.6,656,"golf","122*15*10",122,15,10,"75-91",20]
["QGS10-8-741",9,367,1,0.5,657,"fork","89*14*9",89,14,9,"367g",9,{"$f":"VLOOKUP(A:A,[2]成品数据统计表!$C$1:$E$65536,3,0)","v":{"$error":"#REF!"}}]
["QGS10-1-741",9,350,1,0.5,659,"fork","89*14*9",89,14,9,{"$error":"#N/A"},{"$error":"#N/A"},"Y"]
["SHR-MOM-095",9,323,50,1.48,660,"Shaft","145*29*16",145,29,16,"309-323",5]
["SHR-MOM-105",9,321,50,1.48,661,"Shaft","145*29*16",145,29,16,"307-321",0]
["UPNSKRULIL-40",9,65,50,0.6,662,"golf","122*15*10",122,15,10,"59-65",0]
["QCOMPS20-8H-744",9,433,1,0.5,663,"fork","89*14*9",89,14,9,"433g",0]
["UBLUPNT835WS-46",9,91,50,0.6,664,"golf","122*15*10",122,15,10,"85-91",5]
["UBLUPNT835WX-46",9,92,50,0.6,665,"golf","122*15*10",122,15,10,"86-92",42]
["CCM-V10-TT-4056",9,320,50,1.48,666,"shaft","145*29*16",145,29,16,"310-320",0]
["CCM-V8.9-TT-4056",9,360,50,1.48,667,"shaft","145*29*16",145,29,16,"350-360",69]
["QX2-8-741",9,383,1,0.5,668,"fork","89*14*9",89,14,9,"383g",0]
["QX2-8-744",9,460,1,0.5,669,"fork","89*14*9",89,14,9,"383g",0]
["SHR-MOM-085",9,316,50,1.48,670,"shaft","145*29*16",145,29,16,"302-316",147]
["BAL-SQ-08054-UP",9,320,50,1.48,671,"shaft","145*29*16",145,29,16,"310-320",0]
["BAL-SQ-09054-UP",9,335,50,1.48,672,"shaft","145*29*16",145,29,16,"325-335",3]
["CCM-V8-TT-4056",9,360,50,1.48,673,"shaft","145*29*16",145,29,16,"350-360",0]
["QCOMPS20-8-741",9,423,1,0.5,674,"fork","89*14*9",89,14,9,"423g",31,{"$f":"VLOOKUP(A:A,[2]成品数据统计表!$C$1:$E$65536,3,0)","v":{"$error":"#REF!"}}]
["QCX-1-747",9,510,1,0.5,676,"fork","89*14*9",89,14,9,"510g",6]
["UPGF33WR-45",9,72,50,0.6,679,"golf","122*15*10",122,15,10,"66-72",0]
["UPGF33WS-45",9,74,50,0.6,680,"golf","122*15*10",122,15,10,"68-74",0]
["SHR-MOM-S13R",9,155,6,0.2,681,"blade","45*26*8",45,26,8,"145-155",9]
["UBRX35DXX-46",9,80,50,0.6,682,"golf","122*15*10",122,15,10,{"$error":"#N/A"},0,"Y"]
["UBRX35FXX-44",9,80,50,0.6,683,"golf","122*15*10",122,15,10,{"$error":"#N/A"},0,"Y"]
["UBRXDR-46",9,80,50,0.6,684,"golf","122*15*10",122,15,10,{"$error":"#N/A"},0,"Y"]
["UBRXDXX-46",9,80,50,0.6,685,"golf","122*15*10",122,15,10,{"$error":"#N/A"},18,"Y"]
["UBRXFR-44",9,80,50,0.6,686,"golf","122*15*10",122,15,10,{"$error":"#N/A"},0,"Y"]
["UBRXFS-44",9,80,50,0.6,687,"golf","122*15*10",122,15,10,{"$error":"#N/A"},0,"Y"]
["UBRXFXX-44",9,80,50,0.6,688,"golf","122*15*10",122,15,10,{"$error":"#N/A"},0,"Y"]
["QWOLFCL-8-743",9,515,25,2.54,689,"fork1","72*52*32",72,52,32,"515g",0]
["UBRXDA-44",9,80,50,0.6,690,"golf","122*15*10",122,15,10,{"$error":"#N/A"},0,"Y"]
["USLAL33WR-45",9,72,50,0.6,691,"golf","122*15*10",122,15,10,"66-72",0]
["USLAL33WS-45",9,74,50,0.6,692,"golf","122*15*10",122,15,10,"68-74",0]
["USLAL37IR-40",9,69,50,0.6,693,"golf","122*15*10",122,15,10,"63-69",0]
["ULAUNCH6SEWR-46",9,69,50,0.6,694,"golf","122*15*10",122,15,10,"63-69",114]
["ULAUNCH6SEWS-46",9,67,50,0.6,695,"golf","122*15*10",122,15,10,"61-67",285]
["UPRLTRAM33WR-45",9,72,50,0.6,696,"golf","122*15*10",122,15,10,"66-72",131]
["QGS30-8-744",9,322,1,0.5,697,"fork","89*14*9",89,14,9,"322g",19,{"$f":"VLOOKUP(A:A,[2]成品数据统计表!$C$1:$E$65536,3,0)","v":{"$error":"#REF!"}}]
["UMGLL733WR-46",9,76,50,0.6,698,"golf","122*15*10",122,15,10,"70-76",157]
["ULAUNCHADFWR-44",9,75,50,0.6,699,"golf","122*15*10",122,15,10,"69-75",20]
["UPRLTRAM33WS-45",9,74,50,0.6,700,"golf","122*15*10",122,15,10,"68-74",42]
["UPRLTRAM33WL-45",9,64,50,0.6,701,"golf","122*15*10",122,15,10,"58－64",2]
["SHR-FF3-09052P-1",9,320,50,1.48,702,"shaft","145*29*16",145,29,16,"310-320",2]
["SHR-TF-09552P-1",9,329,50,1.48,703,"shaft","145*29*16",145,29,16,"315-329",0]
["ULAUNCHADFWS-44",9,75,50,0.6,704,"golf","122*15*10",122,15,10,"69-75",0]
["UMGMC60WR-45",9,82,50,0.6,705,"golf","122*15*10",122,15,10,"74-82",77]
["UMGMC60WS-45",9,81,50,0.6,706,"golf","122*15*10",122,15,10,"71-81",167]
["UMGMC60WA-45",9,78,50,0.6,707,"golf","122*15*10",122,15,10,"70-78",108]
["UMGMC60WL-45",9,78,50,0.6,708,"golf","122*15*10",122,15,10,"70-78",236]
["UPRLTPS35WR-46",9,68,50,0.6,709,"golf","122*15*10",122,15,10,"62-68",49]
["USKMXHYLIL-43",9,76,50,0.6,710,"golf","122*15*10",122,15,10,"70-76",47]
["UPRLTPS35WS-46",9,69,50,0.6,711,"golf","122*15*10",122,15,10,"63-69",27]
["USKMXPRLIL-43",9,76,50,0.6,712,"golf","122*15*10",122,15,10,"70-76",27]
["CCM-VS-10052",9,326,50,1.48,713,"shaft","145*29*16",145,29,16,"316-326",2]
["USKMXPRLWL-48",9,71,50,0.64,714,"golf","130*15*10",130,15,10,"65-71",22]
["ULAUNCH833WX-46",9,88,50,0.6,715,"golf","122*15*10",122,15,10,"82-88",41]
["CCM-V8-SC-4554",9,327,50,1.48,716,"shaft","145*29*16",145,29,16,"317-327",0]
["CCM-V8-TC-4556",9,342,50,1.48,717,"shaft","145*29*16",145,29,16,"332-342",0]
["CCM-V8-TC-5056",9,342,50,1.48,718,"shaft","145*29*16",145,29,16,"332-342",50]
["CCM-V10-TC-4556",9,312,50,1.48,719,"shaft","145*29*16",145,29,16,"302-312",0]
["CCM-V10-TC-5056",9,315,50,1.48,720,"shaft","145*29*16",145,29,16,"305-315",0]
["BAL-ULTRA-S07L-H",9,143,6,0.2,721,"blade","45*26*8",45,26,8,"133-143",0]
["BAL-ULTRA-S07R-H",9,143,6,0.2,722,"blade","45*26*8",45,26,8,"133-143",0]
["UWBLUPNT635DWR-46",9,65,50,0.6,723,"golf","122*15*10",122,15,10,"59-65",893]
["SHR-MOM-S13L",9,155,6,0.2,724,"blade","45*26*8",45,26,8,"145-155",3]
["CCM-V8-SC-4054",9,327,50,1.48,725,"shaft","145*29*16",145,29,16,"317-327",0]
["SHR-FF3-10052P-1",9,326,50,1.48,726,"shaft","145*29*16",145,29,16,"316-326",26]
["SHR-FF3-12052P-1",9,315,50,1.48,727,"shaft","145*29*16",145,29,16,"305-315",0]
["SHR-TF-10552P-1",9,339,50,1.48,728,"shaft","145*29*16",145,29,16,"325-339",0]
["SHR-TF-08552P-1",9,332,50,1.48,729,"shaft","145*29*16",145,29,16,"318-332",0]
["UWBLUPNT635DWA-46",9,65,50,0.6,730,"golf","122*15*10",122,15,10,"59-65",{"$error":"#N/A"}]
["WWPLWX-46",9,73,50,0.6,731,"golf","122*15*10",122,15,10,"67-73",8]
["USKMXHYLIS-43",9,79,50,0.6,732,"golf","122*15*10",122,15,10,"73-79",83]
["URAMIAL-43",9,76,50,0.6,733,"golf","122*15*10",122,15,10,"70-76",248]
["CCM-V8-SC-5054",9,327,50,1.48,734,"shaft","145*29*16",145,29,16,"317-327",200]
["FRX-WHT-10052",9,323,50,1.48,735,"shaft","145*29*16",145,29,16,"309-323",6]
["FRX-WHT-12052",9,328,50,1.48,736,"shaft","145*29*16",145,29,16,"314-328",8]
["UNZ6SEIR-41",9,82,50,0.6,737,"golf","122*15*10",122,15,10,"76-82",2]
["UNZ6SEIS-41",9,82,50,0.6,738,"golf","122*15*10",122,15,10,"76-82",0]
["UNZ633SEWS-46",9,68,50,0.6,739,"golf","122*15*10",122,15,10,"62-68",3]
["UNZ633SEWR-46",9,67,50,0.6,740,"golf","122*15*10",122,15,10,"61-67",21]
["CCM-V8-SC-5554",9,327,50,1.48,741,"shaft","145*29*16",145,29,16,"317-327",0]
["URAM33WAL-48",9,71,50,0.64,742,"golf","130*15*10",130,15,10,"65-71",23]
["UW430PFL-45",9,68,50,0.6,743,"golf","122*15*10",122,15,10,"62-68",0]
["URAMIRS-43",9,79,50,0.6,744,"golf","122*15*10",122,15,10,"73-79",55]
["UW430PDA-47",9,60,50,0.6,745,"golf","122*15*10",122,15,10,{"$error":"#N/A"},9,"Y","Y"]
["USKMXPRLWS-48",9,77,50,0.64,746,"golf","130*15*10",130,15,10,"71-77",0]
["URAM33WRS-48",9,77,50,0.64,747,"golf","130*15*10",130,15,10,"71-77",36]
["USKMXPRLIS-43",9,79,50,0.6,748,"golf","122*15*10",122,15,10,"73-79",174]
["PASS-EVO-07054",9,350,50,1.48,749,"shaft","145*29*16",145,29,16,{"$error":"#N/A"},1]
["PASS-EVO-09054",9,350,50,1.48,750,"shaft","145*29*16",145,29,16,{"$error":"#N/A"},12]
["PASS-EVO-10054",9,350,50,1.48,751,"shaft","145*29*16",145,29,16,{"$error":"#N/A"},0]
["PASS-EVO-11054",9,350,50,1.48,752,"shaft","145*29*16",145,29,16,{"$error":"#N/A"},0]
["PASS-EVO-12054",9,350,50,1.48,753,"shaft","145*29*16",145,29,16,{"$error":"#N/A"},13]
["PASS-COMP-SF-09052",9,320,50,1.48,754,"shaft","145*29*16",145,29,16,"310-320",1]
["PASS-COMP-SF-10052",9,326,50,1.48,755,"shaft","145*29*16",145,29,16,"316-326",8]
["PASS-COMP-SF-11052",9,326,50,1.48,756,"shaft","145*29*16",145,29,16,"316-326",21]
["PASS-COMP-SF-12052",9,311,50,1.48,757,"shaft","145*29*16",145,29,16,"301-311",1]
["UBLKIS-41",9,80,50,0.6,758,"golf","122*15*10",122,15,10,"无本步骤",162]
["QCS10-8-744",9,500,1,0.5,759,"fork1","89*14*9",89,14,9,{"$error":"#N/A"},0,"Y"]
["CCM-V8-SC-4054-NG",9,327,50,1.48,760,"shaft","145*29*16",145,29,16,"317-327",14]
["CCM-V8-SC-4554-NG",9,327,50,1.48,761,"shaft","145*29*16",145,29,16,"317-327",14]
["CCM-V8-SC-5054-NG",9,327,50,1.48,762,"shaft","145*29*16",145,29,16,"317-327",51]
["CCM-V8-SC-5554-NG",9,327,50,1.48,763,"shaft","145*29*16",145,29,16,"317-327",31]
["GSAL355IR-40-T",9,69,50,0.6,764,"golf","122*15*10",122,15,10,"63-69",9]
["GSAL355IS-40-T",9,72,50,0.6,765,"golf","122*15*10",122,15,10,"66-72",32]
["CCM-V8-TT-4556",9,380,50,1.48,766,"shaft","145*29*16",145,29,16,{"$error":"#N/A"},0,"Y"]
["CCM-V8-TT-5056",9,380,50,1.48,767,"shaft","145*29*16",145,29,16,{"$error":"#N/A"},0,"Y"]
["CCM-V8-TT-5556",9,380,50,1.48,768,"shaft","145*29*16",145,29,16,{"$error":"#N/A"},0,"Y"]
["UWBLUPNT635DWS-46",9,67,50,0.6,769,"golf","122*15*10",122,15,10,"61-67",588]
["ULAUNCH635WR-46-WIL",9,70,50,0.6,770,"golf","122*15*10",122,15,10,"64-70",79]
["ULAUNCH635WS-46-WIL",9,67,50,0.6,771,"golf","122*15*10",122,15,10,"61-67",8]
["CCM-V8-ST-4054",9,360,50,1.48,772,"shaft","145*29*16",145,29,16,{"$error":"#N/A"},0,"Y"]
["CCM-V8-ST-4554",9,360,50,1.48,773,"shaft","145*29*16",145,29,16,{"$error":"#N/A"},0,"Y"]
["CCM-V8-ST-5054",9,320,50,1.48,774,"shaft","145*29*16",145,29,16,{"$error":"#N/A"},0,"Y"]
["CCM-V8-ST-5554",9,360,50,1.48,775,"shaft","145*29*16",145,29,16,{"$error":"#N/A"},0,"Y"]
["CCM-V8-TC-4056",9,342,50,1.48,776,"shaft","145*29*16",145,29,16,"332-342",0]
["CCM-V8-TC-5556",9,342,50,1.48,777,"shaft","145*29*16",145,29,16,"332-342",0]
["FRX-WHT-S03R-H",9,145,6,0.2,778,"blade","45*26*8",45,26,8,"135-145",0]
["FRX-WHT-S03L-H",9,145,6,0.2,779,"blade","45*26*8",45,26,8,"135-145",0]
["CCM-V10-ST-4554",9,349.99,50,1.48,780,"shaft","145*29*16",145,29,16,{"$error":"#N/A"},{"$error":"#N/A"},"Y"]
["CCM-V10-TC-4056",9,312,50,1.48,781,"shaft","145*29*16",145,29,16,"302-312",0]
["CCM-V8.9-ST-4554",9,360,50,1.48,782,"shaft","145*29*16",145,29,16,{"$error":"#N/A"},0,"Y","Y"]
["QGS20-8-743",9,342,1,0.5,783,"fork","89*14*9",89,14,9,"342g",1,{"$f":"VLOOKUP(A:A,[2]成品数据统计表!$C$1:$E$65536,3,0)","v":{"$error":"#REF!"}}]
["UTE33V25WR-46",9,72,50,0.6,784,"golf","122*15*10",122,15,10,"66-72",0]
["UTE33V25WS-46",9,70,50,0.6,785,"golf","122*15*10",122,15,10,"64-70",71]
["CCM-V8.9-ST-5054",9,345,50,1.48,786,"shaft","145*29*16",145,29,16,"335-345",0]
["SHR-TF-11552P-1",9,364,50,1.48,787,"shaft","145*29*16",145,29,16,"350-364",0]
["CCM-V8.9-ST-5554",9,350,50,1.48,788,"shaft","145*29*16",145,29,16,{"$error":"#N/A"},0,"y"]
["UBLULD733W1X-50",9,77,50,0.64,789,"golf","130*15*10",130,15,10,"71-77",81]
["UBLULD733W2X-50",9,78,50,0.64,790,"golf","130*15*10",130,15,10,"72-78",2]
["SHR-MOM-S53L",9,150,6,0.2,791,"blade","45*26*8",45,26,8,"140-150",15]
["SHR-MOM-S53R",9,150,6,0.2,792,"blade","45*26*8",45,26,8,"140-150",15]
["SHR-MOM-S56L",9,150,6,0.2,793,"blade","45*26*8",45,26,8,"140-150",2]
["SHR-MOM-S56R",9,150,6,0.2,794,"blade","45*26*8",45,26,8,"140-150",2]
["ULAUNCH535WA-46",9,60,50,0.6,795,"golf","122*15*10",122,15,10,"54-60",50]
["SHR-FF3-11052P-1",9,326,50,1.48,796,"shaft","145*29*16",145,29,16,"316-326",29]
["CCM-V10-TT-4556",9,340,50,1.48,797,"shaft","145*29*16",145,29,16,{"$error":"#N/A"},0,"Y"]
["CCM-V10-TC-5556",9,319,50,1.48,798,"shaft","145*29*16",145,29,16,"309-319",0]
["CCM-V10-TC-6056",9,319,50,1.48,799,"shaft","145*29*16",145,29,16,"309-319",0]
["CCM-V8-SC-6054-NG",9,327,50,1.48,800,"shaft","145*29*16",145,29,16,"317-327",9]
["QGS30-8H-744",9,332,1,0.5,801,"fork","89*14*9",89,14,9,"332g",3]
["CCM-V10-TT-5056",9,340,50,1.48,802,"shaft","145*29*16",145,29,16,{"$error":"#N/A"},50,"Y"]
["CCM-VS-12052",9,320,50,1.48,803,"shaft","145*29*16",145,29,16,{"$error":"#N/A"},7,"Y"]
["CCM-V8-SC-3551",9,310,50,1.48,804,"shaft","145*29*16",145,29,16,"300-310",0]
["UTE33V25WA-46",9,63,50,0.6,805,"golf","122*15*10",122,15,10,"59-63",0]
["UTE33V25WX-46",9,68,50,0.6,806,"golf","122*15*10",122,15,10,"62-68",41]
["CCM-VP-ST-5052-NG",9,326,50,1.48,807,"shaft"," 145*29*16",145,29,16,"316-326",0]
["SHR-TF-07544P-1",9,250,50,1.48,808,"shaft","145*29*16",145,29,16,"240-250",0]
["UPNSKRULIR-40",9,66,50,0.6,809,"golf","122*15*10",122,15,10,"60-66",0]
["UBLULD33-48-X",9,69,50,0.64,810,"golf","130*15*10",130,15,10,"63-69",61]
["CCM-V8.9-TT-5056",9,410,50,1.48,811,"shaft","145*29*16",145,29,16,{"$error":"#N/A"},0,"Y"]
["CCM-V8.9-TT-5556",9,410,50,1.48,812,"shaft","145*29*16",145,29,16,{"$error":"#N/A"},0,"Y"]
["CCM-V10-TT-5556",9,340,50,1.48,813,"shaft","145*29*16",145,29,16,{"$error":"#N/A"},0,"Y"]
["CCM-V8.9-SC-4554",9,327,50,1.48,814,"shaft","145*29*16",145,29,16,"317-327",0]
["CCM-V8-SC-6054",9,327,50,1.48,816,"shaft","145*29*16",145,29,16,"317-327",0]
["CCM-V10-TT-6056",9,360,50,1.48,817,"shaft","145*29*16",145,29,16,{"$error":"#N/A"},0,"Y"]
["UPRLTPS35WX-46",9,73,50,0.6,818,"golf","122*15*10",122,15,10,"67-73",37]
["CCM-V10-TC-3553",9,285,50,1.48,819,"shaft","145*29*16",145,29,16,"275-285",0]
["CCM-V8.9-SC-3551",9,310,50,1.48,820,"shaft","145*29*16",145,29,16,"300-310",0]
["CCM-V8.9-SC-6054",9,327,50,1.48,821,"shaft","145*29*16",145,29,16,"317-327",0]
["CCM-V8.9-ST-4054",9,340,50,1.48,822,"shaft","145*29*16",145,29,16,{"$error":"#N/A"},0,"Y","y"]
["CCM-V8-TT-3553",9,325,50,1.48,823,"shaft","145*29*16",145,29,16,"315-325",0]
["SHR-MOM-S63R",9,150,6,0.2,824,"blade","45*26*8",45,26,8,"140-150",1]
["SHR-MOM-S63L",9,150,6,0.2,825,"blade","45*26*8",45,26,8,"140-150",0]
["CCM-V8.9-TT-4556",9,360,50,1.48,826,"shaft","145*29*16",145,29,16,{"$error":"#N/A"},0,"Y","y"]
["CCM-V8.9-SC-5554",9,327,50,1.48,827,"shaft","145*29*16",145,29,16,"317-327",0]
["CCM-V8-TT-6056",9,380,50,1.48,828,"shaft","145*29*16",145,29,16,{"$error":"#N/A"},0,"Y"]
["CCM-V8-ST-6054",9,360,50,1.48,829,"shaft","145*29*16",145,29,16,{"$error":"#N/A"},0,"Y"]
["UNKSF65WR-45",9,72,50,0.6,830,"golf","122*15*10",122,15,10,"66-72",91]
["UNKSF85WR-44",9,80,50,0.6,831,"golf","122*15*10",122,15,10,"72-80",4]
["CCM-V8-TC-6056",9,342,50,1.48,832,"shaft","145*29*16",145,29,16,"332-342",0]
["UNKSF85HI-41",9,76,50,0.6,833,"golf","122*15*10",122,15,10,"70-76",29]
["UNKSF85WS-44",9,81,50,0.6,834,"golf","122*15*10",122,15,10,"73-81",12]
["ULTOUR33WR-46-RED",9,67,50,0.6,835,"golf","122*15*10",122,15,10,"61-67",0]
["ULTOUR33WS-46-RED",9,70,50,0.6,836,"golf","122*15*10",122,15,10,"64－70",0]
["ULTOUR33WR-46-BLUE",9,70,50,0.6,837,"golf","122*15*10",122,15,10,{"$error":"#N/A"},10,"Y","y"]
["ULTOUR33WS-46-BLUE",9,70,50,0.6,838,"golf","122*15*10",122,15,10,"64－70",0]
["UNKSF65WS-45",9,74,50,0.6,839,"golf","122*15*10",122,15,10,"68-74",9]
["CCM-V8.9-TC-4556",9,342,50,1.48,840,"shaft","145*29*16",145,29,16,"332-342",0]
["ULAUNCHADFWX-44",9,75,50,0.6,841,"golf","122*15*10",122,15,10,"69-75",121]
["UPCSPOON35IR-42",9,69,50,0.6,842,"golf","122*15*10",122,15,10,"63-69",47]
["PASS-TI-07051",9,320,50,1.48,843,"shaft","145*29*16",145,29,16,"300-310",0]
["CCM-V8.9-SC-4056",9,390,50,1.48,844,"shaft","145*29*16",145,29,16,{"$error":"#N/A"},{"$error":"#N/A"},"Y"]
["CCM-V8.9-TC-6056",9,342,50,1.48,845,"shaft","145*29*16",145,29,16,"332-342",0]
["CCM-V8.9-TT-6056",9,390,50,1.48,846,"shaft","145*29*16",145,29,16,{"$error":"#N/A"},0,"Y"]
["ULAUNCHRM633WS-46",9,67,50,0.6,847,"golf","122*15*10",122,15,10,"61-67",101]
["ULAUNCHRM633WR-46",9,69,50,0.6,848,"golf","122*15*10",122,15,10,"63-69",2]
["ULAUNCH533WA-46",9,57,50,0.6,849,"golf","122*15*10",122,15,10,"51-57",40]
["UTCTRHLWR-46",9,66,50,0.6,850,"golf","122*15*10",122,15,10,"60-66",0]
["UTCTRHLWS-46",9,68,50,0.6,851,"golf","122*15*10",122,15,10,"62-68",0]
["UAMP33WR-46",9,67,50,0.6,852,"golf","122*15*10",122,15,10,"61-67",0]
["UAMP33WS-46",9,70,50,0.6,853,"golf","122*15*10",122,15,10,"64-70",12]
["UAMP33WA-46",9,65,50,0.6,854,"golf","122*15*10",122,15,10,"59-65",10]
["CCM-V8-TC-3551",9,340,50,1.48,855,"shaft","145*29*16",145,29,16,{"$error":"#N/A"},2,"Y"]
["M66L-N6-S-03618",9,67,50,0.6,856,"golf","122*15*10",122,15,10,"61-67",0]
["WWTPWWA-47-P2",9,79,50,0.6,857,"golf","122*15*10",122,15,10,"69-79",151]
["WWTPWWL-47-P2",9,79,50,0.6,858,"golf","122*15*10",122,15,10,"69-79",0]
["WWTPWWR-47-P2",9,79,50,0.6,859,"golf","122*15*10",122,15,10,"69-79",84]
["MIS-STA-S56L-08560",9,483,25,1.6,860,"hockey","183*29*16",183,29,16,"318-328",0]
["WWTPWWS-47-P2",9,84,50,0.6,861,"golf","122*15*10",122,15,10,"74-84",4]
["CCM-V8-TC-3051",9,340,50,1.48,862,"shaft","145*29*16",145,29,16,{"$error":"#N/A"},0,"Y"]
["UWFS4WL-45-NC",9,52,50,0.6,863,"golf","122*15*10",122,15,10,"46-52",2]
["UTAIR-40",9,81,50,0.6,864,"golf","122*15*10",122,15,10,"75-81",89]
["UTAFWS-45",9,81,50,0.6,865,"golf","122*15*10",122,15,10,"73-81",141]
["UTADWS-46",9,70,50,0.6,866,"golf","122*15*10",122,15,10,"64-70",22]
["UTADWR-46",9,71,50,0.6,867,"golf","122*15*10",122,15,10,"65-71",81]
["UTAFWR-45",9,80,50,0.6,868,"golf","122*15*10",122,15,10,"72-80",6]
["CCM-V8.9-TC-5556",9,342,50,1.48,869,"shaft","145*29*16",145,29,16,"332-342",{"$error":"#N/A"}]
["CCM-V10-TC-3053",9,296,50,1.48,870,"shaft","145*29*16",145,29,16,"286-296",0]
["CCM-V8.9-TT-3553",9,325,50,1.48,871,"shaft","145*29*16",145,29,16,"315-325",0]
["UCNOTEIX-41",9,111,50,0.6,872,"golf","122*15*10",122,15,10,"105-111",55]
["CCM-V8-ST-3551",9,340,50,1.48,873,"shaft","145*29*16",145,29,16,{"$error":"#N/A"},0,"Y"]
["UCNOTEIS-41",9,106,50,0.6,874,"golf","122*15*10",122,15,10,"100-106",9]
["UTE33V25WL-46",9,64,50,0.6,875,"golf","122*15*10",122,15,10,"58-64",0]
["ULAUNCHPRSTFIR-41",9,76,50,0.6,876,"golf","122*15*10",122,15,10,"70-76",1]
["ULAUNCHPRSTFWR-46",9,67,50,0.6,877,"golf","122*15*10",122,15,10,"61-67",2]
["UTCTRMLWR-46",9,69,50,0.6,878,"golf","122*15*10",122,15,10,"63-69",0]
["UTCTRMLWS-46",9,68,50,0.6,879,"golf","122*15*10",122,15,10,"62-68",0]
["UTCTRMLWX-46",9,70,50,0.6,880,"golf","122*15*10",122,15,10,"64-70",0]
["ULAUNCHRED633WR-46",9,65,50,0.6,881,"golf","122*15*10",122,15,10,"59-65",2]
["ULAUNCHRED633WS-46",9,67,50,0.6,882,"golf","122*15*10",122,15,10,"61-67",526]
["ULAUNCHRED633WX-46",9,69,50,0.6,883,"golf","122*15*10",122,15,10,"63-69",668]
["CCM-V8.9-SC-4054",9,327,50,1.48,884,"shaft","145*29*16",145,29,16,"317-327",0]
["UBLULD33-48-S",9,69,50,0.64,885,"golf","130*15*10",130,15,10,"63-69",44]
["BAL-ULTRA-S07L-M",9,155,6,0.2,886,"blade","45*26*8",45,26,8,"145-155",0]
["BAL-ULTRA-S07R-M",9,155,6,0.2,887,"blade","45*26*8",45,26,8,"145-155",0]
["BAL-ULTRA-S53L-H-09060",9,475,25,1.6,888,"hockey","183*29*16",183,29,16,"310-320",20]
["BAL-ULTRA-S53L-H-10060",9,475,25,1.6,889,"hockey","183*29*16",183,29,16,"310-320",23]
["BAL-ULTRA-S53L-M-09060",9,505,25,1.6,890,"hockey","183*29*16",183,29,16,"340-350",0]
["BAL-ULTRA-S53L-M-10060",9,505,25,1.6,891,"hockey","183*29*16",183,29,16,"340-350",0]
["BAL-ULTRA-S53R-H-09060",9,475,25,1.6,892,"hockey","183*29*16",183,29,16,"310-320",22]
["BAL-ULTRA-S53R-H-10060",9,475,25,1.6,893,"hockey","183*29*16",183,29,16,"310-320",24]
["BAL-ULTRA-S53R-M-09060",9,505,25,1.6,894,"hockey","183*29*16",183,29,16,"340-350",22]
["BAL-ULTRA-S53R-M-10060",9,505,25,1.6,895,"hockey","183*29*16",183,29,16,"340-350",61]
["BAL-ULTRA-S55L-H-09060",9,475,25,1.6,896,"hockey","183*29*16",183,29,16,"310-320",12]
["BAL-ULTRA-S55L-H-10060",9,475,25,1.6,897,"hockey","183*29*16",183,29,16,"310-320",23]
["BAL-ULTRA-S55L-M-09060",9,505,25,1.6,898,"hockey","183*29*16",183,29,16,"340-350",0]
["BAL-ULTRA-S55L-M-10060",9,505,25,1.6,899,"hockey","183*29*16",183,29,16,"340-350",0]
["BAL-ULTRA-S55R-H-09060",9,475,25,1.6,900,"hockey","183*29*16",183,29,16,"310-320",43]
["BAL-ULTRA-S55R-H-10060",9,475,25,1.6,901,"hockey","183*29*16",183,29,16,"310-320",22]
["BAL-ULTRA-S55R-M-09060",9,505,25,1.6,902,"hockey","183*29*16",183,29,16,"340-350",1]
["BAL-ULTRA-S55R-M-10060",9,505,25,1.6,903,"hockey","183*29*16",183,29,16,"340-350",12]
["UMKIS2-40-RED",9,72,50,0.6,904,"golf","122*15*10",122,15,10,"66-72",218]
["CCM-V8-SC-3551-NG",9,340,50,1.48,905,"shaft","145*29*16",145,29,16,{"$error":"#N/A"},0,"Y","y"]
["ULAUNCHRED635WR-46",9,68,50,0.6,906,"golf","122*15*10",122,15,10,"62-68",23]
["ULAUNCHRED635WS-46",9,68,50,0.6,907,"golf","122*15*10",122,15,10,"62-68",30]
["MIS-STA-S56R-08560",9,473,25,1.6,908,"hockey","183*29*16",183,29,16,"318-328",0]
["UMKLAUNCHWS-46-RED",9,70,50,0.6,909,"golf","122*15*10",122,15,10,"63-70",36]
["UMK33FWR2-44-RED",9,80,50,0.6,910,"golf","122*15*10",122,15,10,"72-80",56]
["UMK33FWS2-44-RED",9,81,50,0.6,911,"golf","122*15*10",122,15,10,"73-81",37]
["UMKIR2-40-RED",9,68,50,0.6,912,"golf","122*15*10",122,15,10,"62-68",48]
["ULAUNCHRED635WX-46",9,71,50,0.6,913,"golf","122*15*10",122,15,10,"65-71",62]
["UAXIS733WTX-46",9,80,50,0.6,914,"golf","122*15*10",122,15,10,{"$error":"#N/A"},0,"Y","y"]
["UAXIS733WS-46",9,80,50,0.6,915,"golf","122*15*10",122,15,10,{"$error":"#N/A"},2,"Y"]
["ULAUNCH833WR-46",9,87,50,0.6,916,"golf","122*15*10",122,15,10,"81－87",1]
["UAXIS733WR-46",9,80,50,0.6,917,"golf","122*15*10",122,15,10,{"$error":"#N/A"},20,"Y"]
["UAXIS733WX-46",9,80,50,0.6,918,"golf","122*15*10",122,15,10,{"$error":"#N/A"},0,"Y"]
["BAL-ULTRA-S07L-M-UP",9,155,160,1.7,919,"blade","72*52*32",72,52,32,"145-155",40]
["BAL-ULTRA-S07R-M-UP",9,155,160,1.7,920,"blade","72*52*32",72,52,32,"145-155",51]
["SHR-RM19-08563",9,347,50,1.6,921,"shaft","183*29*16",183,29,16,"333-347",1]
["SHR-RM19-09563",9,347,50,1.6,922,"shaft","183*29*16",183,29,16,"333-347",11]
["QGS10-8H-744-M",9,382,1,0.5,923,"fork","89*14*9",89,14,9,"382g",2,{"$f":"VLOOKUP(A:A,[2]成品数据统计表!$C$1:$E$65536,3,0)","v":{"$error":"#REF!"}}]
["QGS10-8-744-UP",9,400,25,2.54,924,"fork","77*52*32",77,52,32,{"$error":"#N/A"},0,"Y"]
["SHR-RM19-07563",9,347,50,1.6,925,"shaft","183*29*16",183,29,16,"333-347",10]
["SHR-RM19-10563",9,347,50,1.6,926,"shaft","183*29*16",183,29,16,"333-347",3]
["BAL-C410-08055-UP",9,290,50,1.48,927,"shaft","145*29*16",145,29,16,"280-290",0]
["BAL-C410-09055-UP",9,290,50,1.48,928,"shaft","145*29*16",145,29,16,"280-290",0]
["BAL-C410-10055-UP",9,290,50,1.48,929,"shaft","145*29*16",145,29,16,"280-290",11]
["UPRLTIR-41-MD",9,76,50,0.6,930,"golf","122*15*10",122,15,10,"70-76",98]
["BAL-C410-11055-UP",9,290,50,1.48,931,"shaft","145*29*16",145,29,16,"280-290",50]
["CNOTEIS-41",9,106,50,0.6,932,"golf","122*15*10",122,15,10,"100-106",5]
["CNOTEIX-41",9,111,50,0.6,933,"golf","122*15*10",122,15,10,"105-111",0]
["MIS-STA-S53L-08560",9,483,25,1.6,934,"hockey","183*29*16",183,29,16,"318-328",0]
["MIS-STA-S53R-08560",9,483,25,1.6,935,"hockey","183*29*16",183,29,16,"318-328",0]
["QCOMPS10-8-744-2",9,515,1,0.5,936,"fork1","89*14*9",89,14,9,"460g",1,{"$f":"VLOOKUP(A:A,[2]成品数据统计表!$C$1:$E$65536,3,0)","v":{"$error":"#REF!"}}]
["UPRLTIL-41-MD",9,71,50,0.6,937,"golf","122*15*10",122,15,10,"65-71",922]
["M66L-N6X+-03618",9,70,50,0.6,938,"golf","122*15*10",122,15,10,{"$error":"#N/A"},0,"Y","y"]
["MIS-STA-ULT-07056",9,290,50,1.48,939,"shaft","145*29*16",145,29,16,"280-290",0]
["MIS-STA-ULT-08056",9,290,50,1.48,940,"shaft","145*29*16",145,29,16,"280-290",2]
["MIS-STA-ULT-10056",9,290,50,1.48,941,"shaft","145*29*16",145,29,16,"280-290",3]
["BAL-ULTRA-S53L-M-08060",9,505,25,1.6,942,"hockey","183*29*16",183,29,16,"340-350",3]
["BAL-ULTRA-S55L-M-08060",9,505,25,1.6,943,"hockey","183*29*16",183,29,16,"340-350",0]
["BAL-ULTRA-S55R-M-08060",9,505,25,1.6,944,"hockey","183*29*16",183,29,16,"340-350",0]
["QCX-8-747-2",9,495,1,0.5,945,"fork","89*14*9",89,14,9,"495g",1]
["BAL-ULTRA-S53R-M-11060",9,505,25,1.6,946,"hockey","183*29*16",183,29,16,"340-350",1]
["BAL-ULTRA-S53R-M-08060",9,505,25,1.6,947,"hockey","183*29*16",183,29,16,"340-350",0]
["BAL-ULTRA-S53L-M-11060",9,505,25,1.6,948,"hockey","183*29*16",183,29,16,"340-350",0]
["BAL-ULTRA-S55L-M-11060",9,505,25,1.6,949,"hockey","183*29*16",183,29,16,"340-350",0]
["BAL-ULTRA-S55R-M-11060",9,505,25,1.6,950,"hockey","183*29*16",183,29,16,"340-350",0]
["ULAUNCHMSTWR-45",9,72,50,0.6,951,"golf","122*15*10",122,15,10,"66-72",544]
["ULAUNCHMSTIR-41",9,68,50,0.6,952,"golf","122*15*10",122,15,10,"62-68",277]
["BAL-ULTRA-S53L-H-08060",9,475,25,1.6,953,"hockey","183*29*16",183,29,16,"310-320",1]
["BAL-ULTRA-S53L-H-11060",9,475,25,1.6,954,"hockey","183*29*16",183,29,16,"310-320",0]
["BAL-ULTRA-S53R-H-11060",9,475,25,1.6,955,"hockey","183*29*16",183,29,16,"310-320",1]
["BAL-ULTRA-S55L-H-08060",9,475,25,1.6,956,"hockey","183*29*16",183,29,16,"310-320",1]
["BAL-ULTRA-S55L-H-11060",9,475,25,1.6,957,"hockey","183*29*16",183,29,16,"310-320",2]
["BAL-ULTRA-S55R-H-08060",9,475,25,1.6,958,"hockey","183*29*16",183,29,16,"310-320",1]
["BAL-ULTRA-S55R-H-11060",9,475,25,1.6,959,"hockey","183*29*16",183,29,16,"310-320",0]
["BAL-ULTRA-S57L-H-08060",9,475,25,1.6,960,"hockey","183*29*16",183,29,16,"310-320",0]
["BAL-ULTRA-S57L-H-09060",9,475,25,1.6,961,"hockey","183*29*16",183,29,16,"310-320",18]
["BAL-ULTRA-S57L-H-11060",9,475,25,1.6,962,"hockey","183*29*16",183,29,16,"310-320",0]
["BAL-ULTRA-S57L-M-08060",9,505,25,1.6,963,"hockey","183*29*16",183,29,16,"340-350",0]
["BAL-ULTRA-S57L-M-09060",9,505,25,1.6,964,"hockey","183*29*16",183,29,16,"340-350",25]
["BAL-ULTRA-S57L-M-10060",9,505,25,1.6,965,"hockey","183*29*16",183,29,16,"340-350",3]
["BAL-ULTRA-S57L-M-11060",9,505,25,1.6,966,"hockey","183*29*16",183,29,16,"340-350",3]
["BAL-ULTRA-S57R-H-08060",9,475,25,1.6,967,"hockey","183*29*16",183,29,16,"310-320",2]
["BAL-ULTRA-S57R-H-09060",9,475,25,1.6,968,"hockey","183*29*16",183,29,16,"310-320",23]
["BAL-ULTRA-S57R-M-08060",9,505,25,1.6,969,"hockey","183*29*16",183,29,16,"340-350",0]
["BAL-ULTRA-S57R-M-09060",9,505,25,1.6,970,"hockey","183*29*16",183,29,16,"340-350",26]
["BAL-ULTRA-S57R-M-10060",9,505,25,1.6,971,"hockey","183*29*16",183,29,16,"340-350",21]
["BAL-ULTRA-S57R-M-11060",9,505,25,1.6,972,"hockey","183*29*16",183,29,16,"340-350",1]
["BAL-ULTRA-S64L-H-09060",9,475,25,1.6,973,"hockey","183*29*16",183,29,16,"310-320",0]
["BAL-ULTRA-S64L-H-10060",9,475,25,1.6,974,"hockey","183*29*16",183,29,16,"310-320",0]
["BAL-ULTRA-S64L-M-08060",9,505,25,1.6,975,"hockey","183*29*16",183,29,16,"340-350",0]
["BAL-ULTRA-S64L-M-09060",9,505,25,1.6,976,"hockey","183*29*16",183,29,16,"340-350",23]
["BAL-ULTRA-S64L-M-10060",9,505,25,1.6,977,"hockey","183*29*16",183,29,16,"340-350",20]
["BAL-ULTRA-S64L-M-11060",9,505,25,1.6,978,"hockey","183*29*16",183,29,16,"340-350",2]
["BAL-ULTRA-S64R-H-09060",9,475,25,1.6,979,"hockey","183*29*16",183,29,16,"310-320",0]
["BAL-ULTRA-S64R-H-10060",9,475,25,1.6,980,"hockey","183*29*16",183,29,16,"310-320",2]
["BAL-ULTRA-S64R-M-08060",9,505,25,1.6,981,"hockey","183*29*16",183,29,16,"340-350",12]
["BAL-ULTRA-S64R-M-09060",9,505,25,1.6,982,"hockey","183*29*16",183,29,16,"340-350",0]
["BAL-ULTRA-S64R-M-10060",9,505,25,1.6,983,"hockey","183*29*16",183,29,16,"340-350",20]
["BAL-ULTRA-S64R-M-11060",9,505,25,1.6,984,"hockey","183*29*16",183,29,16,"340-350",0]
["UPLT-65-WS-46",9,69,50,0.6,985,"golf","122*15*10",122,15,10,"63-69",111]
["QCX20-8-747",9,475,1,0.5,986,"fork","89*14*9",89,14,9,"475g±7g(带螺钉）",0,{"$f":"VLOOKUP(A:A,[2]成品数据统计表!$C$1:$E$65536,3,0)","v":{"$error":"#REF!"}}]
["BAL-ULTRA-S57L-H-10060",9,475,25,1.6,987,"hockey","183*29*16",183,29,16,"310-320",9]
["BAL-ULTRA-S57R-H-10060",9,475,25,1.6,988,"hockey","183*29*16",183,29,16,"310-320",1]
["BAL-ULTRA-S57R-H-11060",9,475,25,1.6,989,"hockey","183*29*16",183,29,16,"310-320",1]
["BAL-ULTRA-S64L-H-08060",9,475,25,1.6,990,"hockey","183*29*16",183,29,16,"310-320",0]
["BAL-ULTRA-S64R-H-08060",9,475,25,1.6,991,"hockey","183*29*16",183,29,16,"310-320",1]
["BAL-ULTRA-S64L-H-11060",9,475,25,1.6,992,"hockey","183*29*16",183,29,16,"310-320",0]
["BAL-ULTRA-S64R-H-11060",9,475,25,1.6,993,"hockey","183*29*16",183,29,16,"310-320",2]
["BAL-ULTRA-S53R-H-08060",9,475,25,1.6,994,"hockey","183*29*16",183,29,16,{"$error":"#N/A"},1,"Y"]
["BAL-ULTRA-S14L-H",9,145,6,0.2,995,"blade","45*26*8",45,26,8,"135-145",0]
["BAL-ULTRA-S14L-M",9,155,6,0.2,996,"blade","45*26*8",45,26,8,"145-155",14]
["BAL-ULTRA-S14R-H",9,145,6,0.2,997,"blade","45*26*8",45,26,8,"135-145",0]
["BAL-ULTRA-S14R-M",9,155,6,0.2,998,"blade","45*26*8",45,26,8,"145-155",26]
["BAL-ULTRA-S14L-M-UP",9,155,160,1.7,999,"blade","72*52*32",72,52,32,"145-155",130]
["BAL-ULTRA-S14R-M-UP",9,155,160,1.7,1000,"blade","72*52*32",72,52,32,"145-155",76]
["UTAIS-40",9,86,50,0.6,1001,"golf","122*15*10",122,15,10,"80-86",65]
["RBK-VIP-11048-SC",9,301,50,1.48,1002,"shaft","145*29*16",145,29,16,"291-301",6]
["MIS-STA-J51R-5051",9,395,35,1.6,1003,"hockey","183*29*16",183,29,16,"230-240",0]
["MIS-STA-J51L-5051",9,395,35,1.6,1004,"hockey","183*29*16",183,29,16,"230-240",0]
["UBLULD733W3X-50",9,79,50,0.64,1005,"golf","130*15*10",130,15,10,"73-79",35]
["PGT233WS-46",9,67,50,0.6,1006,"golf","122*15*10",122,15,10,"61-67",58]
["AQTB1125-26-2",9,0,0,null,1007,"steer tube",0,0,0,0,{"$error":"#N/A"},16,null,"Y"]
["UWFS3WL-45",9,52,50,0.6,1008,"golf","122*15*10",122,15,10,"46-52",2]
["QGS30-8-744-UP",9,300,25,2.54,1009,"fork","77*52*32",77,52,32,{"$error":"#N/A"},0,"Y","y"]
["BAL-ULTRA-T-08055-UP",9,320,50,1.48,1010,"shaft","145*29*16",145,29,16,"310-320",0]
["BAL-ULTRA-T-09055-UP",9,320,50,1.48,1011,"shaft","145*29*16",145,29,16,"310-320",0]
["BAL-ULTRA-T-10055-UP",9,320,50,1.48,1012,"shaft","145*29*16",145,29,16,"310-320",100]
["BAL-ULTRA-T-11055-UP",9,320,50,1.48,1013,"shaft","145*29*16",145,29,16,"310-320",100]
["MIS-STA-J51R-6555",9,433,35,1.6,1014,"hockey","183*29*16",183,29,16,"268-278",0]
["MIS-STA-J52L-5051",9,395,35,1.6,1015,"hockey","183*29*16",183,29,16,"230-240",0]
["MIS-STA-J52L-6555",9,433,35,1.6,1016,"hockey","183*29*16",183,29,16,"268-278",0]
["MIS-STA-J52R-6555",9,433,35,1.6,1017,"hockey","183*29*16",183,29,16,"268-278",0]
["MIS-STA-J51L-6555",9,433,35,1.6,1018,"hockey","183*29*16",183,29,16,"268-278",0]
["BAL-C410-S53L-10060",9,445,25,1.6,1019,"hockey","183*29*16",183,29,16,"280-290",6]
["BAL-C410-S55L-10060",9,445,25,1.6,1020,"hockey","183*29*16",183,29,16,"280-290",28]
["BAL-C410-S57L-10060",9,445,25,1.6,1021,"hockey","183*29*16",183,29,16,"280-290",5]
["BAL-C410-S64L-10060",9,445,25,1.6,1022,"hockey","183*29*16",183,29,16,"280-290",24]
["BAL-C410-S53R-10060",9,445,25,1.6,1023,"hockey","183*29*16",183,29,16,"280-290",10]
["BAL-C410-S55R-10060",9,445,25,1.6,1024,"hockey","183*29*16",183,29,16,"280-290",26]
["BAL-C410-S57R-10060",9,445,25,1.6,1025,"hockey","183*29*16",183,29,16,"280-290",10]
["BAL-C410-S64R-10060",9,445,25,1.6,1026,"hockey","183*29*16",183,29,16,"280-290",35]
["BAL-C410-S53L-08060",9,445,25,1.6,1027,"hockey","183*29*16",183,29,16,"280-290",11]
["BAL-C410-S53L-09060",9,445,25,1.6,1028,"hockey","183*29*16",183,29,16,"280-290",29]
["BAL-C410-S53L-11060",9,445,25,1.6,1029,"hockey","183*29*16",183,29,16,"280-290",0]
["BAL-C410-S53R-09060",9,445,25,1.6,1030,"hockey","183*29*16",183,29,16,"280-290",26]
["BAL-C410-S53R-11060",9,445,25,1.6,1031,"hockey","183*29*16",183,29,16,"280-290",0]
["BAL-C410-S55L-08060",9,445,25,1.6,1032,"hockey","183*29*16",183,29,16,"280-290",0]
["BAL-C410-S55L-11060",9,445,25,1.6,1033,"hockey","183*29*16",183,29,16,"280-290",0]
["BAL-C410-S55R-08060",9,445,25,1.6,1034,"hockey","183*29*16",183,29,16,"280-290",0]
["BAL-C410-S55R-09060",9,445,25,1.6,1035,"hockey","183*29*16",183,29,16,"280-290",3]
["BAL-C410-S55R-11060",9,445,25,1.6,1036,"hockey","183*29*16",183,29,16,"280-290",0]
["BAL-C410-S57L-08060",9,445,25,1.6,1037,"hockey","183*29*16",183,29,16,"280-290",0]
["BAL-C410-S57L-09060",9,445,25,1.6,1038,"hockey","183*29*16",183,29,16,"280-290",2]
["BAL-C410-S57R-08060",9,445,25,1.6,1039,"hockey","183*29*16",183,29,16,"280-290",1]
["BAL-C410-S57R-09060",9,445,25,1.6,1040,"hockey","183*29*16",183,29,16,"280-290",0]
["BAL-C410-S57R-11060",9,445,25,1.6,1041,"hockey","183*29*16",183,29,16,"280-290",0]
["BAL-C410-S64L-08060",9,445,25,1.6,1042,"hockey","183*29*16",183,29,16,"280-290",8]
["BAL-C410-S64L-09060",9,445,25,1.6,1043,"hockey","183*29*16",183,29,16,"280-290",1]
["BAL-C410-S64L-11060",9,445,25,1.6,1044,"hockey","183*29*16",183,29,16,"280-290",0]
["BAL-C410-S64R-08060",9,445,25,1.6,1045,"hockey","183*29*16",183,29,16,"280-290",9]
["BAL-C410-S64R-09060",9,445,25,1.6,1046,"hockey","183*29*16",183,29,16,"280-290",1]
["BAL-C410-S64R-11060",9,445,25,1.6,1047,"hockey","183*29*16",183,29,16,"280-290",0]
["BAL-C410-S53R-08060",9,445,25,1.6,1048,"hockey","183*29*16",183,29,16,"280-290",0]
["BAL-C410-S55L-09060",9,445,25,1.6,1049,"hockey","183*29*16",183,29,16,"280-290",0]
["BAL-C410-S57L-11060",9,445,25,1.6,1050,"hockey","183*29*16",183,29,16,"280-290",0]
["QGS30-8-744-B",9,322,1,0.5,1051,"fork","89*14*9",89,14,9,"322g",0,{"$f":"VLOOKUP(A:A,[2]成品数据统计表!$C$1:$E$65536,3,0)","v":{"$error":"#REF!"}}]
["MIS-STA-S53R-10060",9,483,25,1.6,1052,"hockey","183*29*16",183,29,16,"318-328",0]
["MIS-STA-S53L-10060",9,483,25,1.6,1053,"hockey","183*29*16",183,29,16,"318-328",0]
["MIS-STA-J52R-5051",9,395,35,1.6,1054,"hockey","183*29*16",183,29,16,"230-240",0]
["QCX-8-747",9,530,1,0.5,1055,"fork","89*14*9",89,14,9,{"$error":"#N/A"},0,"Y"]
["MIS-STA-S56R-10060",9,444,25,1.6,1056,"hockey","183*29*16",183,29,16,"318-328",0]
["MIS-STA-S56L-10060",9,427,25,1.6,1057,"hockey","183*29*16",183,29,16,"318-328",0]
["UWFS3WL-F-45",9,52,50,0.6,1058,"golf","122*15*10",122,15,10,"46-52",48]
["QGS10-8-741-UP",9,400,25,2.54,1059,"fork","77*52*32",77,52,32,{"$error":"#N/A"},0,"Y"]
["ULAUNCHPSWR-46",9,67,50,0.6,1060,"golf","122*15*10",122,15,10,"61-67",64]
["ULAUNCHPSWL-46",9,65,50,0.6,1061,"golf","122*15*10",122,15,10,"59-65",26]
["ULAUNCHPSWS-46",9,70,50,0.6,1062,"golf","122*15*10",122,15,10,"64-70",0]
["UTADWL-46",9,65,50,0.6,1063,"golf","122*15*10",122,15,10,"59-65",25]
["ULAUNCHPSWA-46",9,63,50,0.6,1064,"golf","122*15*10",122,15,10,"59-63",14]
["USRXTSWR-45",9,67,50,0.6,1065,"golf","122*15*10",122,15,10,"61-67",1]
["USRXTSIR-41",9,76,50,0.6,1066,"golf","122*15*10",122,15,10,"70-76",461]
["USRXTSIL-39",9,71,50,0.6,1067,"golf","122*15*10",122,15,10,"65-71",335]
["USRXTSWL-45",9,65,50,0.6,1068,"golf","122*15*10",122,15,10,"59-65",3]
["ULAUNCHFW33R-44",9,84,50,0.6,1069,"golf","122*15*10",122,15,10,"78-84",0]
["ULAUNCHFW33S-44",9,87,50,0.6,1070,"golf","122*15*10",122,15,10,"81-87",0]
["ULAUNCHFW33A-44",9,83,50,0.6,1071,"golf","122*15*10",122,15,10,"77-83",11]
["UPLT-65-WX-46",9,67,50,0.6,1072,"golf","122*15*10",122,15,10,"63-67",21]
["UTFC10035DR-46",9,68,50,0.6,1073,"golf","122*15*10",122,15,10,"62-68",10]
["UTFC10035DS-46",9,69,50,0.6,1074,"golf","122*15*10",122,15,10,"63-69",48]
["SAMPEC",9,80,50,0.6,1075,"golf","122*15*10",122,15,10,{"$error":"#N/A"},0,"Y"]
["USRXTSIS-41",9,76,50,0.6,1076,"golf","122*15*10",122,15,10,"70-76",25]
["CLITEIS-41",9,85,50,0.6,1077,"golf","122*15*10",122,15,10,"79-85",0]
["UCLITEIX-41",9,86,50,0.6,1078,"golf","122*15*10",122,15,10,"80-86",0]
["UCLITEIS-41",9,85,50,0.6,1079,"golf","122*15*10",122,15,10,"79-85",0]
["USRXTSIA-41",9,71,50,0.6,1080,"golf","122*15*10",122,15,10,"65-71",0]
["USRXTSWA-45",9,63,50,0.6,1081,"golf","122*15*10",122,15,10,"59-63",16]
["USRXTSWS-45",9,70,50,0.6,1082,"golf","122*15*10",122,15,10,"64-70",6]
["UBLUPNTHY35WX-44",9,80,50,0.6,1083,"golf","122*15*10",122,15,10,{"$error":"#N/A"},26,"Y"]
["CCM-V8-TC-4556-1",9,350,50,1.48,1084,"shaft","145*29*16",145,29,16,{"$error":"#N/A"},0,"Y"]
["UALJLFWL-45",9,60,50,0.6,1085,"golf","122*15*10",122,15,10,{"$error":"#N/A"},5,"Y","y"]
["UALJLIL-40",9,60,50,0.6,1086,"golf","122*15*10",122,15,10,{"$error":"#N/A"},2,"Y","y"]
["UALJLWL-45",9,60,50,0.6,1087,"golf","122*15*10",122,15,10,{"$error":"#N/A"},1,"Y","y"]
["ULAUNCHHYJLIR-41",9,80,50,0.6,1088,"golf","122*15*10",122,15,10,{"$error":"#N/A"},11,"Y","y"]
["ULAUNCHJLFWS-44",9,80,50,0.6,1089,"golf","122*15*10",122,15,10,{"$error":"#N/A"},23,"Y","y"]
["ULAUNCHJLIR-41",9,80,50,0.6,1090,"golf","122*15*10",122,15,10,{"$error":"#N/A"},11,"Y","y"]
["ULAUNCHJLWR-46",9,70,50,0.6,1091,"golf","122*15*10",122,15,10,{"$error":"#N/A"},10,"Y","y"]
["ULAUNCHJLWS-46",9,80,50,0.6,1092,"golf","122*15*10",122,15,10,{"$error":"#N/A"},3,"Y","y"]
["CUR-SIG-1848",9,194,12,0.64,1093,"冰壶杆","130*15*10",130,15,10,"180-194",5]
["CUR-SIG-148",9,163,12,0.64,1094,"冰壶杆","130*15*10",130,15,10,"157-163",2]
["ULAUNCHREDFWWS-44",9,78,50,0.6,1095,"golf","122*15*10",122,15,10,"72-78",70]
["ULAUNCHREDFWWX-44",9,78,50,0.6,1096,"golf","122*15*10",122,15,10,"72-78",24]
["UGPB33DX-46-BLACK",9,80,50,0.6,1097,"golf","122*15*10",122,15,10,{"$error":"#N/A"},0,"Y"]
["UMAXFLIMIRS-43",9,79,50,0.6,1098,"golf","122*15*10",122,15,10,"73-79",37]
["UMAXFLIMWRS-48",9,77,50,0.64,1099,"golf","130*15*10",130,15,10,"71-77",273]
["UMAXFLIMWAL-48",9,71,50,0.64,1100,"golf","130*15*10",130,15,10,"65-71",65]
["UMAXFLIMIAL-43",9,76,50,0.6,1101,"golf","122*15*10",122,15,10,"70-76",0]
["QCOMPS10-8H-744-2",9,470,1,0.5,1102,"fork1","89*14*9",89,14,9,"470g",1,{"$f":"VLOOKUP(A:A,[2]成品数据统计表!$C$1:$E$65536,3,0)","v":{"$error":"#REF!"}}]
["ESP10BEL",9,445,25,1.6,1103,"hockey","183*29*16",183,29,16,"280-290",37]
["ESP10BER",9,445,25,1.6,1104,"hockey","183*29*16",183,29,16,"280-290",18]
["ESP10CLL",9,445,25,1.6,1105,"hockey","183*29*16",183,29,16,"280-290",63]
["ESP10CLR",9,445,25,1.6,1106,"hockey","183*29*16",183,29,16,"280-290",24]
["ESP10TAL",9,445,25,1.6,1107,"hockey","183*29*16",183,29,16,"280-290",1]
["ESP70BEL",9,445,25,1.6,1108,"hockey","183*29*16",183,29,16,"280-290",0]
["ESP70BER",9,445,25,1.6,1109,"hockey","183*29*16",183,29,16,"280-290",0]
["ESP70CLL",9,445,25,1.6,1110,"hockey","183*29*16",183,29,16,"280-290",0]
["ESP70CLR",9,445,25,1.6,1111,"hockey","183*29*16",183,29,16,"280-290",0]
["ESP70TAL",9,445,25,1.6,1112,"hockey","183*29*16",183,29,16,"280-290",0]
["ESP70TAR",9,445,25,1.6,1113,"hockey","183*29*16",183,29,16,"280-290",0]
["ESP80BEL",9,445,25,1.6,1114,"hockey","183*29*16",183,29,16,"280-290",0]
["ESP80BER",9,445,25,1.6,1115,"hockey","183*29*16",183,29,16,"280-290",0]
["ESP80CLL",9,445,25,1.6,1116,"hockey","183*29*16",183,29,16,"280-290",24]
["ESP80CLR",9,445,25,1.6,1117,"hockey","183*29*16",183,29,16,"280-290",0]
["ESP80TAL",9,445,25,1.6,1118,"hockey","183*29*16",183,29,16,"280-290",1]
["ESP80TAR",9,445,25,1.6,1119,"hockey","183*29*16",183,29,16,"280-290",0]
["ESP90BEL",9,445,25,1.6,1120,"hockey","183*29*16",183,29,16,"280-290",1]
["ESP90BER",9,445,25,1.6,1121,"hockey","183*29*16",183,29,16,"280-290",0]
["ESP90CLL",9,445,25,1.6,1122,"hockey","183*29*16",183,29,16,"280-290",36]
["ESP90CLR",9,445,25,1.6,1123,"hockey","183*29*16",183,29,16,"280-290",18]
["ESP90TAL",9,445,25,1.6,1124,"hockey","183*29*16",183,29,16,"280-290",0]
["ESP90TAR",9,445,25,1.6,1125,"hockey","183*29*16",183,29,16,"280-290",0]
["UFRMR70IS-45",9,70,54,0.6,1126,"golf","122*15*10",122,15,10,{"$error":"#N/A"},0,"y"]
["UFRMR70WR-48",9,44,54,0.64,1127,"golf","130*15*10",130,15,10,"38-44",0]
["UFRMR70WS-48",9,45,54,0.64,1128,"golf","130*15*10",130,15,10,"39-45",21]
["ESP10TAR",9,445,25,1.6,1131,"hockey","183*29*16",183,29,16,"280-290",0]
["QGS10-8H-744-2-M",9,352,1,0.5,1132,"fork","89*14*9",89,14,9,"352g",0,{"$f":"VLOOKUP(A:A,[2]成品数据统计表!$C$1:$E$65536,3,0)","v":{"$error":"#REF!"}}]
["UAXIS933WS-46",9,80,50,0.6,1133,"golf","122*15*10",122,15,10,{"$error":"#N/A"},31,"y","Y"]
["UAXIS933WX-46",9,90,50,0.6,1134,"golf","122*15*10",122,15,10,{"$error":"#N/A"},0,"y","Y"]
["QTS20-8-743-2",9,477,1,0.5,1135,"fork","89*14*9",89,14,9,"477g",0,{"$f":"VLOOKUP(A:A,[2]成品数据统计表!$C$1:$E$65536,3,0)","v":{"$error":"#REF!"}}]
["ULAUNCHFW33X-44",9,88,50,0.6,1136,"golf","122*15*10",122,15,10,{"$error":"#N/A"},0,"Y","Y"]
["UTCTRHLWX-46",9,68,50,0.6,1137,"golf","122*15*10",122,15,10,"62-68",0]
["TFC100HYS-41",9,84,50,0.6,1138,"golf","122*15*10",122,15,10,{"$error":"#N/A"},0]
["TFC100HYR-41",9,82,50,0.6,1139,"golf","122*15*10",122,15,10,{"$error":"#N/A"},1,"Y","Y"]
["CCM-VP-ST-5052-TH",9,340,50,1.48,1140,"shaft","145*29*16",145,29,16,{"$error":"#N/A"},0,"y","Y"]
["RBK-7K-SC-4554",9,350,50,1.48,1141,"shaft","145*29*16",145,29,16,{"$error":"#N/A"},78,"y"]
["QGS10-8-744-2",9,337,1,0.5,1142,"fork","89*14*9",89,14,9,"337g",2,{"$f":"VLOOKUP(A:A,[2]成品数据统计表!$C$1:$E$65536,3,0)","v":{"$error":"#REF!"}}]
["UMAXFLIROYALWRS-48",9,77,50,0.64,1143,"golf","130*15*10",130,15,10,{"$error":"#N/A"},55,"Y"]
["UTAIL-40",9,84,50,0.6,1144,"golf","122*15*10",122,15,10,"78-84",11]
["UMAXFLIROYALWR-46",9,78,50,0.6,1145,"golf","122*15*10",122,15,10,{"$error":"#N/A"},45,"Y"]
["UMAXFLIROYALWS-46",9,81,50,0.6,1146,"golf","122*15*10",122,15,10,{"$error":"#N/A"},53,"Y"]
["UFRMR70WX-48",9,46,54,0.64,1147,"golf","130*15*10",130,15,10,"40-46",0]
["UMAXFLIRWRS-48",9,77,50,0.64,1149,"golf","130*15*10",130,15,10,"71-77",115]
["UMAXFLIRIRS-43",9,79,50,0.6,1150,"golf","122*15*10",122,15,10,"73-79",77]
["ULAUNCHSEIR-41",9,81,50,0.6,1151,"golf","122*15*10",122,15,10,"75-81",111]
["ULAUNCHSEIS-41",9,86,50,0.6,1152,"golf","122*15*10",122,15,10,"80-86",149]
["UFRMR90WX-48",9,67,54,0.64,1153,"golf","130*15*10",130,15,10,"61-67",0]
["UFRMR90WS-48",9,65,54,0.64,1154,"golf","130*15*10",130,15,10,"59-65",0]
["RBK-P226-G02L-57",9,740,12,2.2200000000000002,1155,"goalier","179*42*15",179,42,15,"165-175",5,"y"]
["RBK-P125-G01L-57",9,740,12,2.2200000000000002,1156,"goalier","179*42*15",179,42,15,"171-179",1,"y"]
["ULAUNCHREDADFWWR-46",9,80,50,0.6,1157,"golf","122*15*10",122,15,10,{"$error":"#N/A"},0,"y","Y"]
["ULAUNCHREDADFWWS-46",9,80,50,0.6,1158,"golf","122*15*10",122,15,10,{"$error":"#N/A"},0,"y","Y"]
["ULAUNCHREDADWS-46",9,80,50,0.6,1159,"golf","122*15*10",122,15,10,{"$error":"#N/A"},145,"y","Y"]
["ULAUNCHREDADWR-46",9,80,50,0.6,1160,"golf","122*15*10",122,15,10,{"$error":"#N/A"},1,"Y","Y"]
["ULAUNCHMSTIL-41",9,80,50,0.6,1161,"golf","122*15*10",122,15,10,{"$error":"#N/A"},102,"Y","Y"]
["TAQS3-10-CV-CB-70044",9,400,1,0.5,1162,"fork","89*14*9",89,14,9,{"$error":"#N/A"},0,"y"]
["TAQ-100-CX-CB-70047",9,400,1,0.5,1163,"fork","89*14*9",89,14,9,"waiting",0,"y"]
["TAQ-100-ST-CB-70044-UP",9,400,25,2.54,1164,"fork","77*52*32",77,52,32,"waiting",0,"y"]
["QCOMPS20-1-637",9,398,1,0.5,1165,"fork","89*14*9",89,14,9,"398g",0]
["TAQA-1125-ST-CB-65040-GL",9,400,1,0.5,1166,"fork","89*14*9",89,14,9,{"$error":"#N/A"},0,"y"]
["TAQEX-1125-ST-CB-70038",9,400,1,0.5,1167,"fork","89*14*9",89,14,9,{"$error":"#N/A"},0,"y"]
["SHR-RM-08552",9,332,50,1.48,1168,"shaft","145*29*16",145,29,16,"318-332",8]
["SHR-RM-09552",9,329,50,1.48,1169,"shaft","145*29*16",145,29,16,"315-329",39]
["SHR-RM-10552",9,339,50,1.48,1170,"shaft","145*29*16",145,29,16,"325-339",15]
["SHR-RM-11552",9,364,50,1.48,1171,"shaft","145*29*16",145,29,16,"350-364",4]
["ULAUNCHSEFW33S-44",9,87,50,0.6,1172,"golf","122*15*10",122,15,10,"81-87",278]
["ULAUNCHSEFW33R-44",9,84,50,0.6,1173,"golf","122*15*10",122,15,10,"78-84",16]
["RBK-7.1K-SC-4054",9,340,50,1.48,1174,"shaft","145*29*16",145,29,16,{"$error":"#N/A"},7,null,"y"]
["RBK-7.1K-SC-4554",9,340,50,1.48,1175,"shaft","145*29*16",145,29,16,{"$error":"#N/A"},0,null,"y"]
["RBK-7.1K-SC-5054",9,340,50,1.48,1176,"shaft","145*29*16",145,29,16,{"$error":"#N/A"},38,null,"y"]
["RBK-7.1K-SC-5554",9,340,50,1.48,1177,"shaft","145*29*16",145,29,16,{"$error":"#N/A"},1,null,"y"]
["RBK-7.1K-ST-4054",9,340,50,1.48,1178,"shaft","145*29*16",145,29,16,{"$error":"#N/A"},8,null,"y"]
["RBK-7.1K-ST-4554",9,340,50,1.48,1179,"shaft","145*29*16",145,29,16,{"$error":"#N/A"},0,null,"y"]
["RBK-7.1K-ST-5054",9,340,50,1.48,1180,"shaft","145*29*16",145,29,16,{"$error":"#N/A"},5,null,"y"]
["RBK-7.1K-ST-5554",9,340,50,1.48,1181,"shaft","145*29*16",145,29,16,{"$error":"#N/A"},6,null,"y"]
["RBK-7.1K-TC-4056",9,340,50,1.48,1182,"shaft","145*29*16",145,29,16,{"$error":"#N/A"},1,null,"y"]
["RBK-7.1K-TC-4556",9,340,50,1.48,1183,"shaft","145*29*16",145,29,16,{"$error":"#N/A"},4,null,"y"]
["RBK-7.1K-TC-5056",9,340,50,1.48,1184,"shaft","145*29*16",145,29,16,{"$error":"#N/A"},3,null,"y"]
["RBK-7.1K-TC-5556",9,340,50,1.48,1185,"shaft","145*29*16",145,29,16,{"$error":"#N/A"},0,null,"y"]
["RBK-7.1K-TT-4056",9,340,50,1.48,1186,"shaft","145*29*16",145,29,16,{"$error":"#N/A"},3,null,"y"]
["RBK-7.1K-TT-4556",9,340,50,1.48,1187,"shaft","145*29*16",145,29,16,{"$error":"#N/A"},4,null,"y"]
["RBK-7.1K-TT-5056",9,340,50,1.48,1188,"shaft","145*29*16",145,29,16,{"$error":"#N/A"},6,null,"y"]
["RBK-7.1K-TT-5556",9,340,50,1.48,1189,"shaft","145*29*16",145,29,16,{"$error":"#N/A"},12,null,"y"]
["ULAUNCHPSIA-41",9,84,50,0.6,1190,"golf","122*15*10",122,15,10,{"$error":"#N/A"},0,null,"y"]
["ULAUNCHPSIL-41",9,84,50,0.6,1191,"golf","122*15*10",122,15,10,{"$error":"#N/A"},0,null,"y"]
["ULAUNCHPSIR-41",9,68,50,0.6,1192,"golf","122*15*10",122,15,10,{"$error":"#N/A"},0,null,"Y"]
["ULAUNCHPSIS-41",9,68,50,0.6,1193,"golf","122*15*10",122,15,10,{"$error":"#N/A"},0,null,"Y"]
["ULAUNCHPSISW-41",9,72,50,0.6,1194,"golf","122*15*10",122,15,10,{"$error":"#N/A"},135,null,"Y"]
["SHR-RM19-11563",9,347,50,1.6,1195,"shaft","183*29*16",183,29,16,"333-347",0]
["SHR-RM-07552",9,321,50,1.48,1196,"shaft","145*29*16",145,29,16,"307-321",71]
["PSP-272-350",9,260,8,0.2,1197,"seat post","45*26*8",45,26,8,{"$error":"#N/A"},0]
["PSP-272-270",9,220,8,0.2,1198,"seat post","45*26*8",45,26,8,{"$error":"#N/A"},0]
["UTFC10035FWR-445",9,80,50,0.6,1199,"golf","122*15*10",122,15,10,{"$error":"#N/A"},0,"y"]
["UFRMR90WR-48",9,61,54,0.64,1200,"golf","130*15*10",130,15,10,"55-61",0]
["UTFC10035FWS-445",9,80,50,0.6,1201,"golf","122*15*10",122,15,10,{"$error":"#N/A"},0,"y"]
["UPRLTIA-41-MD",9,80,50,0.6,1202,"golf","122*15*10",122,15,10,{"$error":"#N/A"},296,"y"]
["RBK-7.1K-ST-6054",9,340,50,1.48,1203,"shaft","145*29*16",145,29,16,{"$error":"#N/A"},5,"y"]
["CLITEIX-41",9,86,50,0.6,1204,"golf","122*15*10",122,15,10,"80-86",0]
["SHR-RM9-S03L",9,155,6,0.2,1205,"blade","45*26*8",45,26,8,"145-155",6]
["SHR-RM9-S04R",9,155,6,0.2,1206,"blade","45*26*8",45,26,8,"145-155",22]
["SHR-RM9-S04L",9,155,6,0.2,1207,"blade","45*26*8",45,26,8,"145-155",2]
["SHR-RM9-S13L",9,155,6,0.2,1208,"blade","45*26*8",45,26,8,"145-155",212]
["SHR-RM9-S13R",9,155,6,0.2,1209,"blade","45*26*8",45,26,8,"145-155",198]
["SHR-RM9-S03R",9,155,6,0.2,1210,"blade","45*26*8",45,26,8,"145-155",4]
["TB1125-LT-26",9,0,0,null,1211,"steer tube",0,0,0,0,{"$error":"#N/A"},0]
["WLNBLK1",9,76,50,0.6,1212,"golf","122*15*10",122,15,10,{"$error":"#N/A"},560,null,"Y"]
["QGS10-8-744-2-UP",9,340,25,2.54,1213,"fork","77*52*32",77,52,32,{"$error":"#N/A"},11,null,"Y"]
["RBK-7K-TT-4056",9,320,50,1.48,1214,"shaft","145*29*16",145,29,16,"310-320",0]
["SHR-RM9-S05R",9,155,6,0.2,1215,"blade","45*26*8",45,26,8,"145-155",18]
["SHR-RM9-S05L",9,155,6,0.2,1216,"blade","45*26*8",45,26,8,"145-155",33]
["SHR-RM9-S06R",9,155,6,0.2,1217,"blade","45*26*8",45,26,8,"145-155",19]
["SHR-RM9-S06L",9,155,6,0.2,1218,"blade","45*26*8",45,26,8,"145-155",10]
["SHR-RM9-S15R",9,155,6,0.2,1219,"blade","45*26*8",45,26,8,"142-152",5]
["SHR-RM9-S15L",9,152,6,0.2,1220,"blade","45*26*8",45,26,8,"142-152",4]
["RBK-7.1K-TT-3554-DP",9,340,50,1.48,1221,"shaft","145*29*16",145,29,16,{"$error":"#N/A"},6]
["TB1125-26",9,0,0,null,1222,"steer tube",0,0,0,0,{"$error":"#N/A"},258]
["ULAUNCHMSTWL-45",9,64,50,0.6,1223,"golf","122*15*10",122,15,10,{"$error":"#N/A"},74,null,"Y"]
["UFRMR75WS-48",9,47,54,0.64,1224,"golf","130*15*10",130,15,10,"无本步骤",7,null,"Y"]
["UFRMR75WX-48",9,52,54,0.64,1225,"golf","130*15*10",130,15,10,"无本步骤",0,null,"Y"]
["BAL-ULTRA-S63L-M-09060",9,505,25,1.6,1226,"hockey","183*29*16",183,29,16,"340-350",0]
["BAL-ULTRA-S63R-M-10060",9,505,25,1.6,1227,"hockey","183*29*16",183,29,16,"340-350",0]
["BAL-ULTRA-S63L-M-10060",9,505,25,1.6,1228,"hockey","183*29*16",183,29,16,"340-350",0]
["BAL-ULTRA-S63L-M-08060",9,505,25,1.6,1229,"hockey","183*29*16",183,29,16,"340-350",1]
["BAL-ULTRA-S63R-M-08060",9,505,25,1.6,1230,"hockey","183*29*16",183,29,16,"340-350",0]
["BAL-ULTRA-S63R-M-09060",9,505,25,1.6,1231,"hockey","183*29*16",183,29,16,"340-350",0]
["QWOLFCL-GL",9,520,25,2.54,1232,"fork1","72*52*32",72,52,32,{"$error":"#N/A"},9]
["FRMRHYIR-45",9,50.5,54,0.6,1233,"golf","122*15*10",122,15,10,{"$error":"#N/A"},0,null,"Y"]
["ULAUNCHMSTWA-45",9,68.599999999999994,50,0.6,1234,"golf","122*15*10",122,15,10,{"$error":"#N/A"},26,null,"Y"]
["ULAUNCHMSTWS-45",9,73.599999999999994,50,0.6,1235,"golf","122*15*10",122,15,10,{"$error":"#N/A"},2,null,"Y"]
["UFRMRHYIR-45",9,50,54,0.6,1236,"golf","122*15*10",122,15,10,{"$error":"#N/A"},0,null,"Y"]
["UFRMRHYIS-45",9,54,54,0.6,1237,"golf","122*15*10",122,15,10,"48-54",0]
["ULAUNCHREDHYIX-41",9,86,50,0.6,1238,"golf","122*15*10",122,15,10,{"$error":"#N/A"},275,null,"Y"]
["BAL-C410-S63L-08060",9,445,25,1.6,1239,"hockey","183*29*16",183,29,16,"280-290",0]
["BAL-C410-S63L-09060",9,445,25,1.6,1240,"hockey","183*29*16",183,29,16,"280-290",5]
["BAL-C410-S63L-10060",9,445,25,1.6,1241,"hockey","183*29*16",183,29,16,"280-290",6]
["BAL-C410-S63R-08060",9,445,25,1.6,1242,"hockey","183*29*16",183,29,16,"280-290",0]
["BAL-C410-S63R-09060",9,445,25,1.6,1243,"hockey","183*29*16",183,29,16,"280-290",8]
["BAL-C410-S63R-10060",9,445,25,1.6,1244,"hockey","183*29*16",183,29,16,"280-290",3]
["SHR-RM9-S07L",9,155,6,0.2,1245,"blade","45*26*8",45,26,8,"145-155",8]
["RBK-7K-SC-4054",9,300,50,1.48,1246,"shaft","145*29*16",145,29,16,{"$error":"#N/A"},23,null,"Y"]
["UTEGEO33WR-45",9,72,50,0.6,1247,"golf","122*15*10",122,15,10,{"$error":"#N/A"},97,null,"Y"]
["UFRMRHYIX-45",9,59,54,0.6,1248,"golf","122*15*10",122,15,10,"53-59",0]
["LAUNCHREDHYIS-41",9,86,50,0.6,1249,"golf","122*15*10",122,15,10,{"$error":"#N/A"},251,null,"Y"]
["LAUNCHREDHYIX-41",9,85,50,0.6,1250,"golf","122*15*10",122,15,10,{"$error":"#N/A"},61,null,"Y"]
["PLHB-42-R",9,235,1,0.4,1251,"handbar","52*20*15",52,20,15,null,0]
["PLHB-44-R",9,240,1,0.4,1252,"handbar","52*20*15",52,20,15,null,0]
["ULAUNCHREDHYIS-41",9,86,50,0.6,1253,"golf","122*15*10",122,15,10,{"$error":"#N/A"},140,null,"Y"]
["UTEGEO33WA-45",9,69,50,0.6,1254,"golf","122*15*10",122,15,10,{"$error":"#N/A"},224,null,"Y"]
["UTEGEO33WS-45",9,74,50,0.6,1255,"golf","122*15*10",122,15,10,{"$error":"#N/A"},491,null,"Y"]
["RBK-7K-SC-5054",9,320,50,1.48,1256,"shaft","145*29*16",145,29,16,{"$error":"#N/A"},19,null,"Y"]
["ULAUNCHREDIS-40",9,89,50,0.6,1257,"golf","122*15*10",122,15,10,"83-89",22]
["UFRMR90WR-48-350",9,63,54,0.64,1258,"golf","130*15*10",130,15,10,"无本步骤",0,null,"Y"]
["UAXIS933WTX-46",9,97,50,0.6,1259,"golf","122*15*10",122,15,10,"91-97",{"$error":"#N/A"}]
["BAL-C410-S63R-11060",9,440,25,1.6,1260,"hockey","183*29*16",183,29,16,{"$error":"#N/A"},12,null,"Y"]
["UTEGEO33WL-45",9,68,50,0.6,1261,"golf","122*15*10",122,15,10,{"$error":"#N/A"},76,null,"Y"]
["ULAUNCHREDIR-40",9,85,50,0.6,1262,"golf","122*15*10",122,15,10,{"$error":"#N/A"},11,null,"Y"]
["BAL-ULTRA-S13R-M",9,155,6,0.2,1263,"blade","45*26*8",45,26,8,"145-155",15]
["BAL-ULTRA-S13L-M",9,155,6,0.2,1264,"blade","45*26*8",45,26,8,"145-155",15]
["BAL-P126-G01L-57",9,740,12,2.2200000000000002,1265,"goalier","179*42*15",179,42,15,"163-171",2]
["BAL-P125-G01L-57",9,740,12,2.2200000000000002,1266,"goalier","179*42*15",179,42,15,"163-171",0,"Y"]
["RBK-7K-SC-5554",9,340,50,1.48,1267,"shaft","145*29*16",145,29,16,{"$error":"#N/A"},51,null,"Y"]
["FRMRHYIS-45",9,54,54,0.6,1268,"golf","122*15*10",122,15,10,"48-54",0]
["UTEGEO33WX-45",9,78,50,0.6,1269,"golf","122*15*10",122,15,10,{"$error":"#N/A"},4,null,"Y"]
["UFRMR90WS-48-350",9,64,54,0.64,1270,"golf","130*15*10",130,15,10,"无本步骤",0,null,"Y"]
["BAL-ULTRA-S13R-H",9,143,6,0.2,1271,"blade","45*26*8",45,26,8,"133-143",0]
["BAL-ULTRA-S13L-H",9,143,6,0.2,1272,"blade","45*26*8",45,26,8,"133-143",3]
["CCM-V10-TC-4056-BL",9,320,50,1.48,1273,"shaft","145*29*16",145,29,16,{"$error":"#N/A"},8,null,"Y"]
["FRMRHYIX-45",9,59,54,0.6,1274,"golf","122*15*10",122,15,10,"53-59",0]
["UFRMR90WX-48-350",9,65,54,0.64,1275,"golf","130*15*10",130,15,10,"无本步骤",2]
["SHR-RM9-S07R",9,155,6,0.2,1276,"blade","45*26*8",45,26,8,"145-155",12]
["SHR-RMTF-09553",9,323,50,1.48,1277,"shaft","145*29*16",145,29,16,"309-323",2]
["SHR-RMTF-08553",9,316,50,1.48,1278,"shaft","145*29*16",145,29,16,"302-316",7]
["SHR-RMTF-10553",9,321,50,1.48,1279,"shaft","145*29*16",145,29,16,"307-321",3]
["LAUNCHREDIS-405",9,90,50,0.6,1280,"golf","122*15*10",122,15,10,{"$error":"#N/A"},361,null,"Y"]
["LAUNCHREDIS-39",9,88,50,0.6,1281,"golf","122*15*10",122,15,10,"82-88",0]
["LAUNCHREDIS-395",9,88,50,0.6,1282,"golf","122*15*10",122,15,10,"82-88",0]
["LAUNCHREDIS-38",9,88,50,0.6,1283,"golf","122*15*10",122,15,10,"82-88",0]
["LAUNCHREDIX-405",9,92,50,0.6,1284,"golf","122*15*10",122,15,10,{"$error":"#N/A"},50,null,"Y"]
["LAUNCHREDIX-40",9,null,50,0.6,1285,"golf","122*15*10",122,15,10,{"$error":"#N/A"},{"$error":"#N/A"}]
["LAUNCHREDIR-40",9,87,50,0.6,1286,"golf","122*15*10",122,15,10,"81-87",0]
["LAUNCHREDIR-37",9,87,50,0.6,1287,"golf","122*15*10",122,15,10,"81-87",0]
["LAUNCHREDIR-39",9,87,50,0.6,1288,"golf","122*15*10",122,15,10,"81-87",0]
["LAUNCHREDIR-395",9,87,50,0.6,1289,"golf","122*15*10",122,15,10,"81-87",0]
["LAUNCHREDIR-385",9,87,50,0.6,1290,"golf","122*15*10",122,15,10,"81-87",0]
["LAUNCHREDIR-365",9,87,50,0.6,1291,"golf","122*15*10",122,15,10,"81-87",0]
["LAUNCHREDIS-385",9,88,50,0.6,1292,"golf","122*15*10",122,15,10,"82-88",0]
["LAUNCHREDIS-40",9,88,50,0.6,1293,"golf","122*15*10",122,15,10,"82-88",0]
["LAUNCHREDIS-365",9,88,50,0.6,1294,"golf","122*15*10",122,15,10,"82-88",0]
["LAUNCHREDIR-375",9,87,50,0.6,1295,"golf","122*15*10",122,15,10,"81-87",0]
["QGS10-8-746",9,367,1,0.5,1296,"fork","89*14*9",89,14,9,"367g",1]
["QGS10-8-750",9,367,1,0.5,1297,"fork","89*14*9",89,14,9,"367g",0]
["QGS10-8-741-2-UP",9,367,25,2.54,1298,"fork","77*52*32",77,52,32,"337g",1,{"$f":"VLOOKUP(A:A,[2]成品数据统计表!$C$1:$E$65536,3,0)","v":{"$error":"#REF!"}}]
["LAUNCHIS-41",9,86,50,0.6,1299,"golf","122*15*10",122,15,10,"80-86",41]
["LAUNCHIR-41",9,81,50,0.6,1300,"golf","122*15*10",122,15,10,"75-81",23]
["CCM-V10-TC-4556-BL",9,312,50,1.48,1301,"shaft","145*29*16",145,29,16,"302-312",18]
["CCM-V10-TC-5556-BL",9,319,50,1.48,1302,"shaft","145*29*16",145,29,16,"309-319",239]
["CCM-V10-TC-6056-BL",9,319,50,1.48,1303,"shaft","145*29*16",145,29,16,"309-319",0]
["CCM-V10-TC-5056-BL",9,315,50,1.48,1304,"shaft","145*29*16",145,29,16,"305-315",100]
["UIQWRS-48",9,77,50,0.64,1305,"golf","130*15*10",130,15,10,"71-77",154]
["UIQHYIRS-42",9,85,50,0.6,1306,"golf","122*15*10",122,15,10,"77-85",55]
["LAUNCHREDIS-375",9,88,50,0.6,1307,"golf","122*15*10",122,15,10,"82-88",0]
["LAUNCHREDIX-395",9,null,50,0.6,1308,"golf","122*15*10",122,15,10,{"$error":"#N/A"},{"$error":"#N/A"}]
["LAUNCHREDIR-405",9,91,50,0.6,1309,"golf","122*15*10",122,15,10,{"$error":"#N/A"},251,null,"Y"]
["LAUNCHREDIX-385",9,null,50,0.6,1310,"golf","122*15*10",122,15,10,{"$error":"#N/A"},{"$error":"#N/A"}]
["LAUNCHREDIX-375",9,null,50,0.6,1311,"golf","122*15*10",122,15,10,{"$error":"#N/A"},{"$error":"#N/A"}]
["LAUNCHREDIX-365",9,null,50,0.6,1312,"golf","122*15*10",122,15,10,{"$error":"#N/A"},{"$error":"#N/A"}]
["LAUNCHREDIX-37",9,null,50,0.6,1313,"golf","122*15*10",122,15,10,{"$error":"#N/A"},{"$error":"#N/A"}]
["ULAUNCHOS35WR-46",9,68,50,0.6,1314,"golf","122*15*10",122,15,10,"62-68",9]
["ULAUNCHOS35WS-46",9,69,50,0.6,1315,"golf","122*15*10",122,15,10,"63-69",1]
["LAUNCHREDIS-37",9,88,50,0.6,1316,"golf","122*15*10",122,15,10,"82-88",0]
["LAUNCHREDIR-38",9,87,50,0.6,1317,"golf","122*15*10",122,15,10,"81-87",0]
["SHR-RMTF-07553",9,340,50,1.48,1318,"shaft","145*29*16",145,29,16,{"$error":"#REF!"},0,null,"Y"]
["RBK-7K-ST-5554-NG",9,340,50,1.48,1319,"shaft","145*29*16",145,29,16,{"$error":"#N/A"},2,"y"]
["BAL-50C-S53L-06558",9,442,25,1.6,1320,"hockey","183*29*16",183,29,16,"277-287",12]
["BAL-50C-S53R-06558",9,442,25,1.6,1321,"hockey","183*29*16",183,29,16,"277-287",12]
["BAL-50C-S55L-06558",9,442,25,1.6,1322,"hockey","183*29*16",183,29,16,"277-287",0]
["BAL-50C-S55R-06558",9,442,25,1.6,1323,"hockey","183*29*16",183,29,16,"277-287",0]
["BAL-50C-S64L-06558",9,442,25,1.6,1324,"hockey","183*29*16",183,29,16,"277-287",0]
["BAL-50C-S64R-06558",9,442,25,1.6,1325,"hockey","183*29*16",183,29,16,"277-287",0]
["QGS10-8H-744-2",9,352,1,0.5,1326,"fork","89*14*9",89,14,9,"352g",6,{"$f":"VLOOKUP(A:A,[2]成品数据统计表!$C$1:$E$65536,3,0)","v":{"$error":"#REF!"}}]
["UPKIR-41",9,67,50,0.6,1327,"golf","122*15*10",122,15,10,"63-69",30]
["UPKIA-41",9,66,50,0.6,1328,"golf","122*15*10",122,15,10,"60-66",64]
["UPKIS-41",9,72,50,0.6,1329,"golf","122*15*10",122,15,10,"66-72",45]
["UFRMR70WS-48-350",9,65,54,0.64,1330,"golf","130*15*10",130,15,10,{"$error":"#REF!"},195,"y"]
["UPK33WR-46",9,70,50,0.6,1331,"golf","122*15*10",122,15,10,"64-70",25]
["UPK33WA-46",9,63,50,0.6,1332,"golf","122*15*10",122,15,10,"59-63",41]
["UPK33WS-46",9,73,50,0.6,1333,"golf","122*15*10",122,15,10,"67-73",31]
["UFRMR70WR-48-350",9,40,54,0.64,1334,"golf","130*15*10",130,15,10,{"$error":"#REF!"},0,null,"y"]
["UFRMR70WX-48-350",9,40,54,0.64,1335,"golf","130*15*10",130,15,10,{"$error":"#REF!"},1,null,"y"]
["UPK33WL-46",9,65,50,0.6,1336,"golf","122*15*10",122,15,10,"59-65",101]
["UPKIL-41",9,65,50,0.6,1337,"golf","122*15*10",122,15,10,"59-65",93]
["CCM-V8.9-ST-4054-AO",9,350,50,1.48,1338,"shaft","145*29*16",145,29,16,{"$error":"#N/A"},0,"y"]
["CCM-V8.9-ST-3554-AO",9,350,50,1.48,1339,"shaft","145*29*16",145,29,16,{"$error":"#N/A"},0,"y"]
["CCM-V10-ST-4054-AO",9,320,50,1.48,1340,"shaft","145*29*16",145,29,16,{"$error":"#N/A"},3,null,"Y"]
["CCM-V10-ST-3554-AO",9,320,50,1.48,1341,"shaft","145*29*16",145,29,16,{"$error":"#N/A"},1]
["ULAUNCHREDFWWR-44",9,74,50,0.6,1342,"golf","122*15*10",122,15,10,"68-74",0]
["PLHB-40-R",9,230,1,0.4,1343,"handbar","52*20*15",52,20,15,null,0]
["LAUNCHREDIR-SET",9,696,6,0.6,1344,"golf","122*15*10",122,15,10,{"$error":"#N/A"},0]
["LAUNCHREDIS-SET",9,704,6,0.6,1345,"golf","122*15*10",122,15,10,{"$error":"#N/A"},0]
["ULAUNCHOSFWWS-44",9,81,50,0.6,1346,"golf","122*15*10",122,15,10,"73-81",13]
["QGS10-8-741-2",9,337,1,0.5,1347,"fork","89*14*9",89,14,9,"337g",11,{"$f":"VLOOKUP(A:A,[2]成品数据统计表!$C$1:$E$65536,3,0)","v":{"$error":"#REF!"}}]
["UCLITEIR-41",9,84,50,0.6,1348,"golf","122*15*10",122,15,10,"78-84",0]
["ULAUNCHOSFWWR-44",9,74,50,0.6,1349,"golf","122*15*10",122,15,10,"72-80",25]
["ULAUNCHOSHYIR-41",9,74,50,0.6,1350,"golf","122*15*10",122,15,10,"70-76",9]
["CCM-V10-TT-4556-RD",9,340,50,1.48,1351,"shaft","145*29*16",145,29,16,{"$error":"#N/A"},3,null,"Y"]
["CCM-V10-TT-5056-RD",9,340,50,1.48,1352,"shaft","145*29*16",145,29,16,{"$error":"#N/A"},96,null,"Y"]
["CCM-V10-TT-5556-RD",9,340,50,1.48,1353,"shaft","145*29*16",145,29,16,{"$error":"#N/A"},43,null,"Y"]
["CCM-V10-TT-6056-RD",9,340,50,1.48,1354,"shaft","145*29*16",145,29,16,{"$error":"#N/A"},1,null,"Y"]
["ULAUNCHREDADWX-46",9,67,50,0.6,1355,"golf","122*15*10",122,15,10,{"$error":"#N/A"},52,null,"Y"]
["RBK-7.1K-SC-3551",9,340,50,1.48,1356,"shaft","145*29*16",145,29,16,{"$error":"#N/A"},0,"y"]
["QGS30-8H-744-B",9,332,1,0.5,1357,"fork","89*14*9",89,14,9,"332g",0]
["ULAUNCHHYRMIR-41",9,76,50,0.6,1358,"golf","122*15*10",122,15,10,"70-76",52]
["ULAUNCHHYRMIS-41",9,76,50,0.6,1359,"golf","122*15*10",122,15,10,"70-76",120]
["BAL-ULTRA-T-12055-UP",9,320,50,1.48,1360,"shaft","145*29*16",145,29,16,{"$error":"#N/A"},50,null,"Y"]
["ULAUNCHREDADHYIS-41",9,80,100,0.72,1361,"golf","111*29*10",111,29,10,"74-80",572]
["QGS10-8-750-2",9,337,1,0.5,1362,"fork","89*14*9",89,14,9,"337g",8,{"$f":"VLOOKUP(A:A,[2]成品数据统计表!$C$1:$E$65536,3,0)","v":{"$error":"#REF!"}}]
["ULAUNCHRMFWR-44",9,84,50,0.6,1363,"golf","122*15*10",122,15,10,"78-84",63]
["ULAUNCHREDADIS-41",9,76,100,0.72,1364,"golf","111*29*10",111,29,10,"70-76",2067]
["ULAUNCHRMFWS-44",9,87,50,0.6,1365,"golf","122*15*10",122,15,10,"81-87",24]
["ULAUNCHREDADIR-41",9,76,100,0.72,1366,"golf","111*29*10",111,29,10,"70-76",9031]
["ULAUNCHREDADHYIR-41",9,78,100,0.72,1367,"golf","111*29*10",111,29,10,"72-78",2307]
["ULAUNCHREDADFWWX-46",9,80,50,0.6,1368,"golf","122*15*10",122,15,10,{"$error":"#N/A"},0,"y"]
["CCM-V10-ST-4054",9,360,50,1.48,1369,"shaft","145*29*16",145,29,16,{"$error":"#N/A"},0,"y"]
["UBLUPNTHY35WS-44",9,79,50,0.6,1370,"golf","122*15*10",122,15,10,"73-79",44]
["ULAUNCHRED35FWWS-44",9,78,50,0.6,1371,"golf","122*15*10",122,15,10,"72-78",72]
["ULAUNCHRED35FWWR-44",9,76,50,0.6,1372,"golf","122*15*10",122,15,10,"70-76",43]
["LAUNCHREDHYIR-41",9,81,50,0.6,1373,"golf","122*15*10",122,15,10,"75-81",306]
["ULAUNCHRED35FWWX-44",9,79,50,0.6,1374,"golf","122*15*10",122,15,10,"73-79",196]
["TB1000-26",9,0,0,null,1375,"steer tube",0,0,0,0,{"$error":"#N/A"},203]
["SHR-RM9-S53R",9,155,6,0.2,1376,"blade","45*26*8",45,26,8,{"$error":"#N/A"},35]
["SHR-RM9-S53L",9,155,6,0.2,1377,"blade","45*26*8",45,26,8,{"$error":"#N/A"},15]
["SHR-RM9-S56R",9,155,6,0.2,1378,"blade","45*26*8",45,26,8,{"$error":"#N/A"},3]
["SHR-RM9-S56L",9,155,6,0.2,1379,"blade","45*26*8",45,26,8,{"$error":"#N/A"},1]
["SHR-RM9-S63R",9,155,6,0.2,1380,"blade","45*26*8",45,26,8,{"$error":"#N/A"},0]
["SHR-RM9-S63L",9,155,6,0.2,1381,"blade","45*26*8",45,26,8,{"$error":"#N/A"},100]
["CCM-V10-COPS-4560-RD",9,360,50,1.5,1382,"shaft","160*29*16",160,29,16,{"$error":"#N/A"},32,null,"y"]
["CCM-V10-COPS-5060-RD",9,360,50,1.5,1383,"shaft","160*29*16",160,29,16,{"$error":"#N/A"},30,null,"y"]
["CCM-V10-COPS-4560-BL",9,360,50,1.5,1384,"shaft","160*29*16",160,29,16,{"$error":"#N/A"},14,null,"y"]
["CCM-V10-COPS-4060-BL",9,360,50,1.5,1385,"shaft","160*29*16",160,29,16,{"$error":"#N/A"},43,null,"y"]
["CCM-V10-COPS-5060-BL",9,360,50,1.5,1386,"shaft","160*29*16",160,29,16,{"$error":"#N/A"},22,null,"y"]
["CCM-V10-COPS-4060-RD",9,360,50,1.5,1387,"shaft","160*29*16",160,29,16,{"$error":"#N/A"},14,null,"y"]
["QGS20-8-640",9,338,1,0.5,1388,"fork","89*14*9",89,14,9,"338g",0]
["QGS20-8-743-UP",9,340,25,2.54,1389,"fork","77*52*32",77,52,32,{"$error":"#N/A"},0,"y"]
["UBHWRS-48",9,77,50,0.64,1390,"golf","130*15*10",130,15,10,"71-77",117]
["UBHWAL-48",9,71,50,0.64,1391,"golf","130*15*10",130,15,10,"65-71",115]
["CCM-V10-COPS-5560-BL",9,360,50,1.5,1392,"shaft","160*29*16",160,29,16,{"$error":"#N/A"},0,"y"]
["ULAUNCHREDHYIR-41",9,81,50,0.6,1393,"golf","122*15*10",122,15,10,{"$error":"#N/A"},358]
["CCM-V10-COPS-4060-YW",9,360,50,1.5,1394,"shaft","160*29*16",160,29,16,{"$error":"#N/A"},56,"y"]
["CCM-V10-COPS-4560-YW",9,360,50,1.5,1395,"shaft","160*29*16",160,29,16,{"$error":"#N/A"},0,"y"]
["SHR-RMLC-08563",9,380,50,1.6,1396,"shaft","183*29*16",183,29,16,"348-362",2]
["SHR-RMLC-09563",9,380,50,1.6,1397,"shaft","183*29*16",183,29,16,"348-362",6]
["SHR-RMLC-10563",9,380,50,1.6,1398,"shaft","183*29*16",183,29,16,"348-362",12]
["RBK-7K-SC-6054",9,320,50,1.48,1399,"shaft","145*29*16",145,29,16,{"$error":"#N/A"},1,null,"Y"]
["SHR-RMTF-11553",9,320,50,1.48,1400,"shaft","145*29*16",145,29,16,{"$error":"#N/A"},58,null,"Y"]
["CCM-V10-COPS-3560-YW",9,360,50,1.5,1401,"shaft","160*29*16",160,29,16,{"$error":"#N/A"},20,null,"Y"]
["CCM-V10-COPS-3560-BL",9,360,50,1.5,1402,"shaft","160*29*16",160,29,16,{"$error":"#N/A"},0,null,"Y"]
["CCM-V10-COPS-3560-RD",9,360,50,1.5,1403,"shaft","160*29*16",160,29,16,{"$error":"#N/A"},0,null,"Y"]
["CCM-V10-COPS-4060-TL",9,360,50,1.5,1404,"shaft","160*29*16",160,29,16,{"$error":"#N/A"},30,"y"]
["CCM-V10-COPS-3560-TL",9,360,50,1.5,1405,"shaft","160*29*16",160,29,16,{"$error":"#N/A"},4,"y"]
["CCM-V10-COPS-3560-LB",9,360,50,1.5,1406,"shaft","160*29*16",160,29,16,{"$error":"#N/A"},0,"y"]
["CCM-V10-COPS-4060-LB",9,360,50,1.5,1407,"shaft","160*29*16",160,29,16,{"$error":"#N/A"},10,"y"]
["CCM-V10-COPS-4560-LB",9,360,50,1.5,1408,"shaft","160*29*16",160,29,16,{"$error":"#N/A"},19,"y"]
["CCM-V10-COPS-4060-DB",9,360,50,1.5,1409,"shaft","160*29*16",160,29,16,{"$error":"#N/A"},99,"y"]
["CCM-V10-COPS-4560-DB",9,360,50,1.5,1410,"shaft","160*29*16",160,29,16,{"$error":"#N/A"},6,"y"]
["CCM-V10-COPS-4560-TL",9,360,50,1.5,1411,"shaft","160*29*16",160,29,16,{"$error":"#N/A"},0,"y"]
["CCM-V10-COPS-5060-YW",9,360,50,1.5,1412,"shaft","160*29*16",160,29,16,{"$error":"#N/A"},0,"y"]
["CCM-V10-COPS-3560-DB",9,360,50,1.5,1413,"shaft","160*29*16",160,29,16,{"$error":"#N/A"},0]
["CCM-V10-TOPS-4560-LB",9,360,50,1.5,1414,"shaft","160*29*16",160,29,16,{"$error":"#N/A"},30,"Y"]
["CCM-V10-TOPS-5060-BL",9,360,50,1.5,1415,"shaft","160*29*16",160,29,16,{"$error":"#N/A"},10]
["CCM-V10-TOPS-5060-RD",9,360,50,1.5,1416,"shaft","160*29*16",160,29,16,{"$error":"#N/A"},16]
["CCM-V10-COPS-5560-RD",9,360,50,1.5,1417,"shaft","160*29*16",160,29,16,{"$error":"#N/A"},3,"Y"]
["CCM-V10-TOPS-4060-BL",9,360,50,1.5,1418,"shaft","160*29*16",160,29,16,{"$error":"#N/A"},10,"Y"]
["CCM-V10-TOPS-4560-BL",9,360,50,1.5,1419,"shaft","160*29*16",160,29,16,{"$error":"#N/A"},51,"Y"]
["CCM-V10-TOPS-4560-YW",9,360,50,1.5,1420,"shaft","160*29*16",160,29,16,{"$error":"#N/A"},20,"Y"]
["SHR-RMLC-09563-BL",9,380,50,1.6,1421,"shaft","183*29*16",183,29,16,"348-362",5]
["SHR-RMLC-10563-BL",9,380,50,1.6,1422,"shaft","183*29*16",183,29,16,"348-362",3,"Y"]
["CCM-V10-TOPS-4560-TL",9,360,50,1.5,1423,"shaft","160*29*16",160,29,16,{"$error":"#N/A"},1,"Y"]
["CCM-V10-TOPS-4560-RD",9,360,50,1.5,1424,"shaft","160*29*16",160,29,16,{"$error":"#N/A"},23,"Y"]
["CCM-V10-TOPS-3560-BD",9,360,50,1.5,1425,"shaft","160*29*16",160,29,16,{"$error":"#N/A"},0,"Y"]
["CCM-V10-TOPS-4060-BD",9,360,50,1.5,1426,"shaft","160*29*16",160,29,16,{"$error":"#N/A"},0,"Y"]
["CCM-V10-TOPS-4060-LB",9,360,50,1.5,1427,"shaft","160*29*16",160,29,16,{"$error":"#N/A"},9,"Y"]
["CCM-V10-TOPS-4560-BD",9,360,50,1.5,1428,"shaft","160*29*16",160,29,16,{"$error":"#N/A"},1,"Y"]
["CCM-V10-TOPS-3560-LB",9,360,50,1.5,1429,"shaft","160*29*16",160,29,16,{"$error":"#N/A"},0,"Y"]
["CCM-V10-TOPS-4060-YW",9,360,50,1.5,1430,"shaft","160*29*16",160,29,16,{"$error":"#N/A"},6,"Y"]
["CCM-V10-TOPS-3560-YW",9,360,50,1.5,1431,"shaft","160*29*16",160,29,16,{"$error":"#N/A"},1,"Y"]
["CCM-V10-TOPS-3560-RD",9,360,50,1.5,1432,"shaft","160*29*16",160,29,16,{"$error":"#N/A"},2,"Y"]
["CCM-V10-TOPS-4060-RD",9,360,50,1.5,1433,"shaft","160*29*16",160,29,16,{"$error":"#N/A"},9,"Y"]
["CCM-V10-TOPS-3560-BL",9,360,50,1.5,1434,"shaft","160*29*16",160,29,16,{"$error":"#N/A"},4,"Y"]
["CCM-V10-TOPS-4060-TL",9,360,50,1.5,1435,"shaft","160*29*16",160,29,16,{"$error":"#N/A"},0,"Y"]
["CCM-V10-TOPS-5060-YW",9,360,50,1.5,1436,"shaft","160*29*16",160,29,16,{"$error":"#N/A"},2]
["CCM-V10-TOPS-6060-RD",9,360,50,1.5,1437,"shaft","160*29*16",160,29,16,{"$error":"#N/A"},3]
["QZ-8-744-UP",9,535,25,2.54,1438,"fork","77*52*32",77,52,32,{"$error":"#N/A"},0,"y"]
["SHR-RMLC-08563-BL",9,362,50,1.6,1439,"shaft","183*29*16",183,29,16,"348-362",0]
["QZ-8-741-UP",9,535,25,2.54,1440,"fork","77*52*32",77,52,32,{"$error":"#N/A"},0,"Y"]
["QGS10-8-750-2-UP",9,350,25,2.54,1441,"fork","77*52*32",77,52,32,{"$error":"#N/A"},1,"Y"]
["QGS10-8-747-2-UP",9,350,25,2.54,1442,"fork","77*52*32",77,52,32,{"$error":"#N/A"},0,"Y"]
["CCM-V8-COPS-5560-NG",9,340,50,1.5,1443,"shaft","160*29*16",160,29,16,{"$error":"#N/A"},3,"y"]
["CCM-V8-COPS-5060-NG",9,340,50,1.5,1444,"shaft","160*29*16",160,29,16,{"$error":"#N/A"},1,"y"]
["CCM-V8-COPS-4060-NG",9,340,50,1.5,1445,"shaft","160*29*16",160,29,16,{"$error":"#N/A"},8,"Y"]
["QWOLFSL-8-743-UP",9,355,25,2.54,2001,"fork","77*52*32",77,52,32,{"$error":"#N/A"},{"$error":"#N/A"},"y"]
["QWOLFCL-8-743-UP",9,515,25,2.54,2002,"fork1","77*52*32",77,52,32,{"$error":"#N/A"},{"$error":"#N/A"}]
["CCM-V8-COPS-4560-NG",9,340,50,1.5,1446,"shaft","160*29*16",160,29,16,{"$error":"#N/A"},28,"y"]
["CCM-V10-TOPS-4060-RD-NG",9,360,50,1.5,1447,"shaft","160*29*16",160,29,16,{"$error":"#N/A"},0,"y"]
["RBK-7K-COPS-5060-NG",9,340,50,1.5,1448,"shaft","160*29*16",160,29,16,{"$error":"#N/A"},0,"y"]
["RBK-7K-COPS-4560-NG",9,340,50,1.5,1449,"shaft","160*29*16",160,29,16,{"$error":"#N/A"},0,"y"]
["RBK-7K-COPS-5560-NG",9,340,50,1.5,1450,"shaft","160*29*16",160,29,16,{"$error":"#N/A"},3,"y"]
["RBK-7K-COPS-4060-NG",9,340,50,1.5,1451,"shaft","160*29*16",160,29,16,{"$error":"#N/A"},0,"y"]
["RBK-7K-COPS-3560",9,340,50,1.5,1452,"shaft","160*29*16",160,29,16,{"$error":"#N/A"},6,"y"]
["RBK-7K-COPS-4060",9,340,50,1.5,1453,"shaft","160*29*16",160,29,16,{"$error":"#N/A"},224,"y"]
["RBK-7K-COPS-4560",9,340,50,1.5,1454,"shaft","160*29*16",160,29,16,{"$error":"#N/A"},2126,"y"]
["RBK-7K-COPS-5060",9,340,50,1.5,1455,"shaft","160*29*16",160,29,16,{"$error":"#N/A"},19,"y"]
["RBK-7K-COPS-5560",9,340,50,1.5,1456,"shaft","160*29*16",160,29,16,{"$error":"#N/A"},0,"y"]
["RBK-7K-TOPS-4560-NG",9,340,50,1.5,1457,"shaft","160*29*16",160,29,16,{"$error":"#N/A"},0,"y"]
["UADPLPTIA-41",9,76,100,0.72,1458,"golf","111*29*11",111,29,10,{"$error":"#N/A"},4345,"y"]
["UADPLPTIR-41",9,76,100,0.72,1459,"golf","111*29*11",111,29,10,{"$error":"#N/A"},6554,"y"]
["UADPLPTIS-41",9,76,100,0.72,1460,"golf","111*29*11",111,29,10,{"$error":"#N/A"},1336,"y"]
["UADPLPTHYIA-42",9,76,100,0.72,1461,"golf","111*29*11",111,29,10,{"$error":"#N/A"},18589,"y"]
["UADPLPTHYIR-42",9,76,100,0.72,1462,"golf","111*29*11",111,29,10,{"$error":"#N/A"},47545,"y"]
["UADPLPTHYIS-42",9,76,100,0.72,1463,"golf","111*29*11",111,29,10,{"$error":"#N/A"},1416,"y"]
["UMAXFLIFIREWRS-48",9,80,50,0.6,1467,"golf","122*15*10",122,15,10,{"$error":"#N/A"},1,"y"]
["RBK-7K-TOPS-4060-NG",9,340,50,1.5,1464,"shaft","160*29*16",160,29,16,{"$error":"#N/A"},0,"y"]
["RBK-7K-TOPS-5060-NG",9,340,50,1.5,1465,"shaft","160*29*16",160,29,16,{"$error":"#N/A"},0,"y"]
["RBK-7K-TOPS-5060",9,340,50,1.5,1466,"shaft","160*29*16",160,29,16,{"$error":"#N/A"},919,"y"]
["RBK-7K-TOPS-4560",9,340,50,1.5,1468,"shaft","160*29*16",160,29,16,{"$error":"#N/A"},605,"y"]
["RBK-7K-TOPS-3560-NG",9,340,50,1.5,1469,"shaft","160*29*16",160,29,16,{"$error":"#N/A"},0,"y"]
["RBK-7K-TOPS-4060",9,340,50,1.5,1470,"shaft","160*29*16",160,29,16,{"$error":"#N/A"},119,"Y"]
["RBK-7K-TOPS-5560",9,340,50,1.5,1471,"shaft","160*29*16",160,29,16,{"$error":"#N/A"},1,"Y"]
["RBK-7K-TOPS-3560",9,340,50,1.5,1472,"shaft","160*29*16",160,29,16,{"$error":"#N/A"},7,"Y"]
["RBK-7K-TOPS-5560-NG",9,340,50,1.5,1473,"shaft","160*29*16",160,29,16,{"$error":"#N/A"},0,"Y"]
["UADPLPTIW-41",9,76,100,0.72,1474,"golf","111*25*10",111,25,10,{"$error":"#N/A"},3424,"y"]
["SHR-RM19-P226-G01L-57",9,740,12,2.2200000000000002,1476,"goalier","179*42*15",179,42,15,{"$error":"#N/A"},15]
["PASS-TI-07054-NG",9,321,50,1.48,1477,"shaft","145*29*16",145,29,16,"311-321",16]
["PASS-TI-10054-NG",9,338,50,1.48,1478,"shaft","145*29*16",145,29,16,"324-338",2]
["RBK-7K-TT-4556-NG",9,340,50,1.48,1475,"shaft","145*29*16",145,29,16,{"$error":"#N/A"},738,null,"y"]
["RBK-7K-TT-4056-NG",9,340,50,1.48,1479,"shaft","145*29*16",145,29,16,{"$error":"#N/A"},481,null,"y"]
["RBK-7K-TT-5056-NG",9,340,50,1.48,1480,"shaft","145*29*16",145,29,16,{"$error":"#N/A"},251,null,"y"]
["RBK-7K-TT-5556-NG",9,340,50,1.48,1481,"shaft","145*29*16",145,29,16,{"$error":"#N/A"},2,null,"y"]
["CCM-V8.9-COPS-4060-BL",9,420,50,1.5,1482,"shaft","160*29*16",160,29,16,{"$error":"#N/A"},3,null,"y"]
["CCM-V8.9-COPS-4560-BL",9,420,50,1.5,1483,"shaft","160*29*16",160,29,16,{"$error":"#N/A"},11,null,"y"]
["UWFS5WR-47",9,64,50,0.6,1484,"golf","122*15*10",122,15,10,{"$error":"#N/A"},77,null,"y"]
["PASS-EVO-10056-NG",9,340,50,1.48,1485,"shaft","145*29*16",145,29,16,{"$error":"#N/A"},0,null,"y"]
["PASS-EVO-07056",9,323,50,1.48,1486,"shaft","145*29*16",145,29,16,"313-323",1]
["PASS-EVO-10056",9,323,50,1.48,1487,"shaft","145*29*16",145,29,16,"313-323",5]
["PASS-EVO-11056",9,323,50,1.48,1488,"shaft","145*29*16",145,29,16,"313-323",1]
["ESP10PRR",9,450,25,1.6,1489,"shaft","183*29*16",183,29,16,"280-290",18]
["QINSERT-SL",9,30,500,3.46,{"$error":"#N/A"},"insert","77*52*32",77,52,32,{"$error":"#N/A"},{"$error":"#N/A"},null,"y"]
["PASS-EVO-10056",9,323,50,1.48,1487,"shaft","145*29*16",145,29,16,"313-323",5]
["PASS-EVO-11056",9,323,50,1.48,1488,"shaft","145*29*16",145,29,16,"313-323",1]
["ESP10PRR",9,450,25,1.6,1489,"hockey","183*29*16",183,29,16,"280-290",18]
["CCM-V10-TOPS-5560-RD",9,360,50,1.5,1490,"shaft","160*29*16",160,29,16,{"$error":"#N/A"},6]
["UMAXFLIEZIRS-43",9,80,50,0.6,1491,"golf","122*15*10",122,15,10,{"$error":"#N/A"},44,"y"]
["ESP10PRL",9,450,25,1.6,1492,"hockey","122*15*10",122,15,10,"280-290",36]
["UWFS5FWWR-44",9,70,50,0.6,1493,"golf","122*15*10",122,15,10,{"$error":"#N/A"},60,"y"]
["BAL-P127-G01L-57",9,740,12,2.2200000000000002,1494,"goalier","179*42*15",179,42,15,"163-171",3]
["CCM-V8-COPS-3060-NG",9,340,50,1.5,1495,"shaft","160*29*16",160,29,16,{"$error":"#N/A"},3]
["SHR-RM19-P225-G01L-57",9,740,12,2.2200000000000002,1496,"goalier","179*42*15",179,42,15,"163-171",0]
["SHR-RM19-P227-G01L-57",9,740,12,2.2200000000000002,1497,"goalier","179*42*15",179,42,15,"163-171",0]