{"text_format":"1","workbook":"xlsx","n_sheets":6,"sheets":["结存","000目录","明细","基础资料","说明","打印结存"],"not_rendered":{"charts":0,"images":0,"macros":1,"external_links":0,"defined_names":3,"comments":0,"pivot_tables":1},"unopened":[],"bounds":{"document_bytes":16777216,"sheet_cells":100000,"rows_first":2000,"rows_last":500,"rows_between":2000,"halvings":0,"cell_chars":16384,"cell_head_chars":4096},"cells_cut":0,"cells_raw":0,"read":"whole","date_system":"1900"}

{"sheet":"结存","index":0,"n_rows":122,"n_cols":12,"rows_kept":122,"cut":false,"hidden":false,"merged":[]}
[null,null,null,null,null,null,"值"]
["内部编号","SKU","存货名称","规格","单位","存货大类","期初数量 ","收入数量 ","发出数量 ","结存(透视表)","结存(公式)","结存差异"]
[1,"0001010273","蓝光-美女与野兽第2季贝儿的心愿1DVD+1BD","2","套","调用成品",null,12,null,{"$f":"G3+H3-I3","v":12},{"$f":"VLOOKUP(A:A,明细!D:M,10,0)","v":12},{"$f":"J3 - K3","v":0}]
[2,"0001010274","蓝光-八恶人1BD+1DVD","2","套","调用成品",null,22,null,22,{"$f":"VLOOKUP(A:A,明细!D:M,10,0)","v":22},0]
[22,"0007050246","猫王这是它的方式（旧版)2CD","\\","套","CD成品",null,20,9,11,{"$f":"VLOOKUP(A:A,明细!D:M,10,0)","v":11},0]
[526,"07010001","蓝剧-地球百子第3季 4BD","4","套","蓝光电视剧",21,null,2,19,{"$f":"VLOOKUP(A:A,明细!D:M,10,0)","v":19},0]
[527,"07010002","蓝剧-降世神通：科拉传奇 第2季 神灵2BD","2","套","蓝光电视剧",99,null,null,99,{"$f":"VLOOKUP(A:A,明细!D:M,10,0)","v":118},-19]
[529,"0701000235","蓝剧传教士 第一季3BD","3","套","蓝光电视剧",null,96,6,90,{"$f":"VLOOKUP(A:A,明细!D:M,10,0)","v":90},0]
[530,"07010003","蓝剧-降世神通：科拉传奇 第3季2BD","2","套","蓝光电视剧",99,null,null,99,{"$f":"VLOOKUP(A:A,明细!D:M,10,0)","v":118},-19]
[531,"07010004","蓝剧-降世神通：科拉传奇 第4季2BD","2","套","蓝光电视剧",85,null,null,85,{"$f":"VLOOKUP(A:A,明细!D:M,10,0)","v":104},-19]
[532,"07010005","蓝剧-我是僵尸第2季  4BD","4","套","蓝光电视剧",61,null,6,55,{"$f":"VLOOKUP(A:A,明细!D:M,10,0)","v":55},0]
[533,"07010006","蓝剧-冰血暴第2季  3BD","3","套","蓝光电视剧",72,null,2,70,{"$f":"VLOOKUP(A:A,明细!D:M,10,0)","v":89},-19]
[534,"07010008","蓝剧-我是僵尸第2季 4BD","4","套","蓝光电视剧",61,null,null,61,{"$f":"VLOOKUP(A:A,明细!D:M,10,0)","v":80},-19]
[536,"07010010","蓝剧-黑色孤儿第1季  2BD","2","套","蓝光电视剧",86,null,1,85,{"$f":"VLOOKUP(A:A,明细!D:M,10,0)","v":104},-19]
[537,"07010011","蓝剧-黑色孤儿第2季  2BD","2","套","蓝光电视剧",85,null,6,79,{"$f":"VLOOKUP(A:A,明细!D:M,10,0)","v":98},-19]
[538,"07010012","蓝剧-地球百子第1季 3BD","3","套","蓝光电视剧",95,null,null,95,{"$f":"VLOOKUP(A:A,明细!D:M,10,0)","v":95},0]
[539,"07010013","蓝剧-黑色孤儿第3季  2BD","2","套","蓝光电视剧",83,4,1,86,{"$f":"VLOOKUP(A:A,明细!D:M,10,0)","v":86},0]
[541,"07010015","蓝剧-黑色孤儿第4季  2BD","2","套","蓝光电视剧",74,null,11,63,{"$f":"VLOOKUP(A:A,明细!D:M,10,0)","v":63},0]
[562,"0702000026","蓝影我们都为比尔着盛装1BD","1","套","蓝光电影",null,98,null,98,{"$f":"VLOOKUP(A:A,明细!D:M,10,0)","v":98},0]
[563,"0702000027","蓝影攀登梅鲁峰1BD","1","套","蓝光电影",null,2,2,0,{"$f":"VLOOKUP(A:A,明细!D:M,10,0)","v":0},0]
[568,"0702000032","蓝影年轻气盛1BD","1","套","蓝光电影",null,99,4,95,{"$f":"VLOOKUP(A:A,明细!D:M,10,0)","v":95},0]
[571,"07020003","蓝影-遇见你之前1BD+1DVD","2","套","蓝光电影",73,null,null,73,{"$f":"VLOOKUP(A:A,明细!D:M,10,0)","v":73},0]
[572,"07020004","蓝影 -一切都会过去：淘儿唱片的浮与沉  1BD","1","套","蓝光电影",87,null,null,87,{"$f":"VLOOKUP(A:A,明细!D:M,10,0)","v":87},0]
[573,"07020005","蓝影-猫王:是这样的:特别版  1BD+1DVD","2","套","蓝光电影",85,null,16,69,{"$f":"VLOOKUP(A:A,明细!D:M,10,0)","v":69},0]
[574,"07020006","蓝影-辛普森一家20周年特辑 2BD","2","套","蓝光电影",15,null,null,15,{"$f":"VLOOKUP(A:A,明细!D:M,10,0)","v":15},0]
[576,"07020008","蓝影-三傻大闹宝莱坞1BD","1","套","蓝光电影",72,null,null,72,{"$f":"VLOOKUP(A:A,明细!D:M,10,0)","v":72},0]
[577,"07020009","蓝影-盖世枭雄1BD","1","套","蓝光电影",73,null,null,73,{"$f":"VLOOKUP(A:A,明细!D:M,10,0)","v":73},0]
[578,"07020010","蓝影-功夫熊猫21BD+2DVD","3","套","蓝光电影",89,null,8,81,{"$f":"VLOOKUP(A:A,明细!D:M,10,0)","v":81},0]
[579,"07020011","蓝影-功夫熊猫3  1BD+1DVD","2","套","蓝光电影",75,null,8,67,{"$f":"VLOOKUP(A:A,明细!D:M,10,0)","v":67},0]
[582,"07020014","蓝影 -银河护卫队  1BD","1","套","蓝光电影",77,null,null,77,{"$f":"VLOOKUP(A:A,明细!D:M,10,0)","v":77},0]
{"$rows_left_out":93}
{"sheet":"000目录","index":1,"n_rows":7,"n_cols":2,"rows_kept":7,"cut":false,"hidden":false,"merged":[]}
["编号","目录"]
[1,"结存"]
[2,"明细"]
[3,"基础资料"]
[4,"说明"]
[5,"使用公式和函数"]
[6,"打印结存"]

{"sheet":"明细","index":2,"n_rows":290,"n_cols":16,"rows_kept":290,"cut":false,"hidden":false,"merged":[]}
["日期","单号","公司或部门","内部编号","SKU","存货名称","规格","单位","存货大类","收入数量","发出数量","期初数量","结存(公式）","结存(引用）","结存(比较）","备注"]
[null,null,null,526,{"$f":"VLOOKUP($D:$D,基础资料!$A:B,2,0)","v":"07010001"},{"$f":"VLOOKUP($D:$D,基础资料!$A:C,3,0)","v":"蓝剧-地球百子第3季 4BD"},{"$f":"VLOOKUP($D:$D,基础资料!$A:D,4,0)","v":"4"},{"$f":"VLOOKUP($D:$D,基础资料!$A:E,5,0)","v":"套"},{"$f":"VLOOKUP($D:$D,基础资料!$A:F,6,0)","v":"蓝光电视剧"},{"$f":"VLOOKUP(H:H,基础资料!E:G,3,0)","v":0},null,21,{"$f":"SUMIF($D:$D,D2,$L:$L)+SUMIF($D:$D,D2,$J:$J)-SUMIF($D:$D,D2,$K:$K)","v":19},{"$f":"VLOOKUP(D:D,结存!A:J,10,0)","v":19},{"$f":"M2 - N2","v":0}]
[null,null,null,527,{"$f":"VLOOKUP($D:$D,基础资料!$A:B,2,0)","v":"07010002"},{"$f":"VLOOKUP($D:$D,基础资料!$A:C,3,0)","v":"蓝剧-降世神通：科拉传奇 第2季 神灵2BD"},{"$f":"VLOOKUP($D:$D,基础资料!$A:D,4,0)","v":"2"},{"$f":"VLOOKUP($D:$D,基础资料!$A:E,5,0)","v":"套"},{"$f":"VLOOKUP($D:$D,基础资料!$A:F,6,0)","v":"蓝光电视剧"},{"$f":"VLOOKUP(I:I,基础资料!F:G,2,0)","v":19},null,99,{"$f":"SUMIF($D:$D,D3,$L:$L)+SUMIF($D:$D,D3,$J:$J)-SUMIF($D:$D,D3,$K:$K)","v":118},{"$f":"VLOOKUP(D:D,结存!A:J,10,0)","v":99},{"$f":"M3 - N3","v":19}]
[null,null,null,530,{"$f":"VLOOKUP($D:$D,基础资料!$A:B,2,0)","v":"07010003"},{"$f":"VLOOKUP($D:$D,基础资料!$A:C,3,0)","v":"蓝剧-降世神通：科拉传奇 第3季2BD"},{"$f":"VLOOKUP($D:$D,基础资料!$A:D,4,0)","v":"2"},{"$f":"VLOOKUP($D:$D,基础资料!$A:E,5,0)","v":"套"},{"$f":"VLOOKUP($D:$D,基础资料!$A:F,6,0)","v":"蓝光电视剧"},{"$f":"VLOOKUP(I:I,基础资料!F:G,2,0)","v":19},null,99,{"$f":"SUMIF($D:$D,D4,$L:$L)+SUMIF($D:$D,D4,$J:$J)-SUMIF($D:$D,D4,$K:$K)","v":118},{"$f":"VLOOKUP(D:D,结存!A:J,10,0)","v":99},{"$f":"M4 - N4","v":19}]
[null,null,null,531,{"$f":"VLOOKUP($D:$D,基础资料!$A:B,2,0)","v":"07010004"},{"$f":"VLOOKUP($D:$D,基础资料!$A:C,3,0)","v":"蓝剧-降世神通：科拉传奇 第4季2BD"},{"$f":"VLOOKUP($D:$D,基础资料!$A:D,4,0)","v":"2"},{"$f":"VLOOKUP($D:$D,基础资料!$A:E,5,0)","v":"套"},{"$f":"VLOOKUP($D:$D,基础资料!$A:F,6,0)","v":"蓝光电视剧"},{"$f":"VLOOKUP(I:I,基础资料!F:G,2,0)","v":19},null,85,{"$f":"SUMIF($D:$D,D5,$L:$L)+SUMIF($D:$D,D5,$J:$J)-SUMIF($D:$D,D5,$K:$K)","v":104},{"$f":"VLOOKUP(D:D,结存!A:J,10,0)","v":85},{"$f":"M5 - N5","v":19}]
[null,null,null,533,{"$f":"VLOOKUP($D:$D,基础资料!$A:B,2,0)","v":"07010006"},{"$f":"VLOOKUP($D:$D,基础资料!$A:C,3,0)","v":"蓝剧-冰血暴第2季  3BD"},{"$f":"VLOOKUP($D:$D,基础资料!$A:D,4,0)","v":"3"},{"$f":"VLOOKUP($D:$D,基础资料!$A:E,5,0)","v":"套"},{"$f":"VLOOKUP($D:$D,基础资料!$A:F,6,0)","v":"蓝光电视剧"},{"$f":"VLOOKUP(I:I,基础资料!F:G,2,0)","v":19},null,72,{"$f":"SUMIF($D:$D,D6,$L:$L)+SUMIF($D:$D,D6,$J:$J)-SUMIF($D:$D,D6,$K:$K)","v":89},{"$f":"VLOOKUP(D:D,结存!A:J,10,0)","v":70},{"$f":"M6 - N6","v":19}]
[null,null,null,534,{"$f":"VLOOKUP($D:$D,基础资料!$A:B,2,0)","v":"07010008"},{"$f":"VLOOKUP($D:$D,基础资料!$A:C,3,0)","v":"蓝剧-我是僵尸第2季 4BD"},{"$f":"VLOOKUP($D:$D,基础资料!$A:D,4,0)","v":"4"},{"$f":"VLOOKUP($D:$D,基础资料!$A:E,5,0)","v":"套"},{"$f":"VLOOKUP($D:$D,基础资料!$A:F,6,0)","v":"蓝光电视剧"},{"$f":"VLOOKUP(I:I,基础资料!F:G,2,0)","v":19},null,61,{"$f":"SUMIF($D:$D,D7,$L:$L)+SUMIF($D:$D,D7,$J:$J)-SUMIF($D:$D,D7,$K:$K)","v":80},{"$f":"VLOOKUP(D:D,结存!A:J,10,0)","v":61},{"$f":"M7 - N7","v":19}]
[null,null,null,536,{"$f":"VLOOKUP($D:$D,基础资料!$A:B,2,0)","v":"07010010"},{"$f":"VLOOKUP($D:$D,基础资料!$A:C,3,0)","v":"蓝剧-黑色孤儿第1季  2BD"},{"$f":"VLOOKUP($D:$D,基础资料!$A:D,4,0)","v":"2"},{"$f":"VLOOKUP($D:$D,基础资料!$A:E,5,0)","v":"套"},{"$f":"VLOOKUP($D:$D,基础资料!$A:F,6,0)","v":"蓝光电视剧"},{"$f":"VLOOKUP(I:I,基础资料!F:G,2,0)","v":19},null,86,{"$f":"SUMIF($D:$D,D8,$L:$L)+SUMIF($D:$D,D8,$J:$J)-SUMIF($D:$D,D8,$K:$K)","v":104},{"$f":"VLOOKUP(D:D,结存!A:J,10,0)","v":85},{"$f":"M8 - N8","v":19}]
[null,null,null,537,{"$f":"VLOOKUP($D:$D,基础资料!$A:B,2,0)","v":"07010011"},{"$f":"VLOOKUP($D:$D,基础资料!$A:C,3,0)","v":"蓝剧-黑色孤儿第2季  2BD"},{"$f":"VLOOKUP($D:$D,基础资料!$A:D,4,0)","v":"2"},{"$f":"VLOOKUP($D:$D,基础资料!$A:E,5,0)","v":"套"},{"$f":"VLOOKUP($D:$D,基础资料!$A:F,6,0)","v":"蓝光电视剧"},{"$f":"VLOOKUP(I:I,基础资料!F:G,2,0)","v":19},null,85,{"$f":"SUMIF($D:$D,D9,$L:$L)+SUMIF($D:$D,D9,$J:$J)-SUMIF($D:$D,D9,$K:$K)","v":98},{"$f":"VLOOKUP(D:D,结存!A:J,10,0)","v":79},{"$f":"M9 - N9","v":19}]
[null,null,null,538,{"$f":"VLOOKUP($D:$D,基础资料!$A:B,2,0)","v":"07010012"},{"$f":"VLOOKUP($D:$D,基础资料!$A:C,3,0)","v":"蓝剧-地球百子第1季 3BD"},{"$f":"VLOOKUP($D:$D,基础资料!$A:D,4,0)","v":"3"},{"$f":"VLOOKUP($D:$D,基础资料!$A:E,5,0)","v":"套"},{"$f":"VLOOKUP($D:$D,基础资料!$A:F,6,0)","v":"蓝光电视剧"},null,null,95,{"$f":"SUMIF($D:$D,D10,$L:$L)+SUMIF($D:$D,D10,$J:$J)-SUMIF($D:$D,D10,$K:$K)","v":95},{"$f":"VLOOKUP(D:D,结存!A:J,10,0)","v":95},{"$f":"M10 - N10","v":0}]
[null,null,null,539,{"$f":"VLOOKUP($D:$D,基础资料!$A:B,2,0)","v":"07010013"},{"$f":"VLOOKUP($D:$D,基础资料!$A:C,3,0)","v":"蓝剧-黑色孤儿第3季  2BD"},{"$f":"VLOOKUP($D:$D,基础资料!$A:D,4,0)","v":"2"},{"$f":"VLOOKUP($D:$D,基础资料!$A:E,5,0)","v":"套"},{"$f":"VLOOKUP($D:$D,基础资料!$A:F,6,0)","v":"蓝光电视剧"},null,null,83,{"$f":"SUMIF($D:$D,D11,$L:$L)+SUMIF($D:$D,D11,$J:$J)-SUMIF($D:$D,D11,$K:$K)","v":86},{"$f":"VLOOKUP(D:D,结存!A:J,10,0)","v":86},{"$f":"M11 - N11","v":0}]
[null,null,null,541,{"$f":"VLOOKUP($D:$D,基础资料!$A:B,2,0)","v":"07010015"},{"$f":"VLOOKUP($D:$D,基础资料!$A:C,3,0)","v":"蓝剧-黑色孤儿第4季  2BD"},{"$f":"VLOOKUP($D:$D,基础资料!$A:D,4,0)","v":"2"},{"$f":"VLOOKUP($D:$D,基础资料!$A:E,5,0)","v":"套"},{"$f":"VLOOKUP($D:$D,基础资料!$A:F,6,0)","v":"蓝光电视剧"},null,null,74,{"$f":"SUMIF($D:$D,D12,$L:$L)+SUMIF($D:$D,D12,$J:$J)-SUMIF($D:$D,D12,$K:$K)","v":63},{"$f":"VLOOKUP(D:D,结存!A:J,10,0)","v":63},{"$f":"M12 - N12","v":0}]
[null,null,null,571,{"$f":"VLOOKUP($D:$D,基础资料!$A:B,2,0)","v":"07020003"},{"$f":"VLOOKUP($D:$D,基础资料!$A:C,3,0)","v":"蓝影-遇见你之前1BD+1DVD"},{"$f":"VLOOKUP($D:$D,基础资料!$A:D,4,0)","v":"2"},{"$f":"VLOOKUP($D:$D,基础资料!$A:E,5,0)","v":"套"},{"$f":"VLOOKUP($D:$D,基础资料!$A:F,6,0)","v":"蓝光电影"},null,null,73,{"$f":"SUMIF($D:$D,D13,$L:$L)+SUMIF($D:$D,D13,$J:$J)-SUMIF($D:$D,D13,$K:$K)","v":73},{"$f":"VLOOKUP(D:D,结存!A:J,10,0)","v":73},{"$f":"M13 - N13","v":0}]
[null,null,null,572,{"$f":"VLOOKUP($D:$D,基础资料!$A:B,2,0)","v":"07020004"},{"$f":"VLOOKUP($D:$D,基础资料!$A:C,3,0)","v":"蓝影 -一切都会过去：淘儿唱片的浮与沉  1BD"},{"$f":"VLOOKUP($D:$D,基础资料!$A:D,4,0)","v":"1"},{"$f":"VLOOKUP($D:$D,基础资料!$A:E,5,0)","v":"套"},{"$f":"VLOOKUP($D:$D,基础资料!$A:F,6,0)","v":"蓝光电影"},{"$f":"VLOOKUP($D:$D,基础资料!$A:G,3,0)","v":"蓝影 -一切都会过去：淘儿唱片的浮与沉  1BD"},null,87,{"$f":"SUMIF($D:$D,D14,$L:$L)+SUMIF($D:$D,D14,$J:$J)-SUMIF($D:$D,D14,$K:$K)","v":87},{"$f":"VLOOKUP(D:D,结存!A:J,10,0)","v":87},{"$f":"M14 - N14","v":0}]
[null,null,null,573,{"$f":"VLOOKUP($D:$D,基础资料!$A:B,2,0)","v":"07020005"},{"$f":"VLOOKUP($D:$D,基础资料!$A:C,3,0)","v":"蓝影-猫王:是这样的:特别版  1BD+1DVD"},{"$f":"VLOOKUP($D:$D,基础资料!$A:D,4,0)","v":"2"},{"$f":"VLOOKUP($D:$D,基础资料!$A:E,5,0)","v":"套"},{"$f":"VLOOKUP($D:$D,基础资料!$A:F,6,0)","v":"蓝光电影"},null,null,85,{"$f":"SUMIF($D:$D,D15,$L:$L)+SUMIF($D:$D,D15,$J:$J)-SUMIF($D:$D,D15,$K:$K)","v":69},{"$f":"VLOOKUP(D:D,结存!A:J,10,0)","v":69},{"$f":"M15 - N15","v":0}]
[null,null,null,574,{"$f":"VLOOKUP($D:$D,基础资料!$A:B,2,0)","v":"07020006"},{"$f":"VLOOKUP($D:$D,基础资料!$A:C,3,0)","v":"蓝影-辛普森一家20周年特辑 2BD"},{"$f":"VLOOKUP($D:$D,基础资料!$A:D,4,0)","v":"2"},{"$f":"VLOOKUP($D:$D,基础资料!$A:E,5,0)","v":"套"},{"$f":"VLOOKUP($D:$D,基础资料!$A:F,6,0)","v":"蓝光电影"},null,null,15,{"$f":"SUMIF($D:$D,D16,$L:$L)+SUMIF($D:$D,D16,$J:$J)-SUMIF($D:$D,D16,$K:$K)","v":15},{"$f":"VLOOKUP(D:D,结存!A:J,10,0)","v":15},{"$f":"M16 - N16","v":0}]
[null,null,null,576,{"$f":"VLOOKUP($D:$D,基础资料!$A:B,2,0)","v":"07020008"},{"$f":"VLOOKUP($D:$D,基础资料!$A:C,3,0)","v":"蓝影-三傻大闹宝莱坞1BD"},{"$f":"VLOOKUP($D:$D,基础资料!$A:D,4,0)","v":"1"},{"$f":"VLOOKUP($D:$D,基础资料!$A:E,5,0)","v":"套"},{"$f":"VLOOKUP($D:$D,基础资料!$A:F,6,0)","v":"蓝光电影"},null,null,72,{"$f":"SUMIF($D:$D,D17,$L:$L)+SUMIF($D:$D,D17,$J:$J)-SUMIF($D:$D,D17,$K:$K)","v":72},{"$f":"VLOOKUP(D:D,结存!A:J,10,0)","v":72},{"$f":"M17 - N17","v":0}]
[null,null,null,577,{"$f":"VLOOKUP($D:$D,基础资料!$A:B,2,0)","v":"07020009"},{"$f":"VLOOKUP($D:$D,基础资料!$A:C,3,0)","v":"蓝影-盖世枭雄1BD"},{"$f":"VLOOKUP($D:$D,基础资料!$A:D,4,0)","v":"1"},{"$f":"VLOOKUP($D:$D,基础资料!$A:E,5,0)","v":"套"},{"$f":"VLOOKUP($D:$D,基础资料!$A:F,6,0)","v":"蓝光电影"},null,null,73,{"$f":"SUMIF($D:$D,D18,$L:$L)+SUMIF($D:$D,D18,$J:$J)-SUMIF($D:$D,D18,$K:$K)","v":73},{"$f":"VLOOKUP(D:D,结存!A:J,10,0)","v":73},{"$f":"M18 - N18","v":0}]
[null,null,null,578,{"$f":"VLOOKUP($D:$D,基础资料!$A:B,2,0)","v":"07020010"},{"$f":"VLOOKUP($D:$D,基础资料!$A:C,3,0)","v":"蓝影-功夫熊猫21BD+2DVD"},{"$f":"VLOOKUP($D:$D,基础资料!$A:D,4,0)","v":"3"},{"$f":"VLOOKUP($D:$D,基础资料!$A:E,5,0)","v":"套"},{"$f":"VLOOKUP($D:$D,基础资料!$A:F,6,0)","v":"蓝光电影"},null,null,89,{"$f":"SUMIF($D:$D,D19,$L:$L)+SUMIF($D:$D,D19,$J:$J)-SUMIF($D:$D,D19,$K:$K)","v":81},{"$f":"VLOOKUP(D:D,结存!A:J,10,0)","v":81},{"$f":"M19 - N19","v":0}]
[null,null,null,579,{"$f":"VLOOKUP($D:$D,基础资料!$A:B,2,0)","v":"07020011"},{"$f":"VLOOKUP($D:$D,基础资料!$A:C,3,0)","v":"蓝影-功夫熊猫3  1BD+1DVD"},{"$f":"VLOOKUP($D:$D,基础资料!$A:D,4,0)","v":"2"},{"$f":"VLOOKUP($D:$D,基础资料!$A:E,5,0)","v":"套"},{"$f":"VLOOKUP($D:$D,基础资料!$A:F,6,0)","v":"蓝光电影"},null,null,75,{"$f":"SUMIF($D:$D,D20,$L:$L)+SUMIF($D:$D,D20,$J:$J)-SUMIF($D:$D,D20,$K:$K)","v":67},{"$f":"VLOOKUP(D:D,结存!A:J,10,0)","v":67},{"$f":"M20 - N20","v":0}]
[null,null,null,582,{"$f":"VLOOKUP($D:$D,基础资料!$A:B,2,0)","v":"07020014"},{"$f":"VLOOKUP($D:$D,基础资料!$A:C,3,0)","v":"蓝影 -银河护卫队  1BD"},{"$f":"VLOOKUP($D:$D,基础资料!$A:D,4,0)","v":"1"},{"$f":"VLOOKUP($D:$D,基础资料!$A:E,5,0)","v":"套"},{"$f":"VLOOKUP($D:$D,基础资料!$A:F,6,0)","v":"蓝光电影"},null,null,77,{"$f":"SUMIF($D:$D,D21,$L:$L)+SUMIF($D:$D,D21,$J:$J)-SUMIF($D:$D,D21,$K:$K)","v":77},{"$f":"VLOOKUP(D:D,结存!A:J,10,0)","v":77},{"$f":"M21 - N21","v":0}]
[null,null,null,583,{"$f":"VLOOKUP($D:$D,基础资料!$A:B,2,0)","v":"07020015"},{"$f":"VLOOKUP($D:$D,基础资料!$A:C,3,0)","v":"蓝影-元气囝仔 2BD+2DVD"},{"$f":"VLOOKUP($D:$D,基础资料!$A:D,4,0)","v":"4"},{"$f":"VLOOKUP($D:$D,基础资料!$A:E,5,0)","v":"套"},{"$f":"VLOOKUP($D:$D,基础资料!$A:F,6,0)","v":"蓝光电影"},null,null,98,{"$f":"SUMIF($D:$D,D22,$L:$L)+SUMIF($D:$D,D22,$J:$J)-SUMIF($D:$D,D22,$K:$K)","v":94},{"$f":"VLOOKUP(D:D,结存!A:J,10,0)","v":94},{"$f":"M22 - N22","v":0}]
[null,null,null,585,{"$f":"VLOOKUP($D:$D,基础资料!$A:B,2,0)","v":"07020017"},{"$f":"VLOOKUP($D:$D,基础资料!$A:C,3,0)","v":"蓝影-刑事  1BD+1DVD"},{"$f":"VLOOKUP($D:$D,基础资料!$A:D,4,0)","v":"2"},{"$f":"VLOOKUP($D:$D,基础资料!$A:E,5,0)","v":"套"},{"$f":"VLOOKUP($D:$D,基础资料!$A:F,6,0)","v":"蓝光电影"},null,null,4,{"$f":"SUMIF($D:$D,D23,$L:$L)+SUMIF($D:$D,D23,$J:$J)-SUMIF($D:$D,D23,$K:$K)","v":4},{"$f":"VLOOKUP(D:D,结存!A:J,10,0)","v":4},{"$f":"M23 - N23","v":0}]
[null,null,null,588,{"$f":"VLOOKUP($D:$D,基础资料!$A:B,2,0)","v":"07020020"},{"$f":"VLOOKUP($D:$D,基础资料!$A:C,3,0)","v":"蓝影-猫王-埃尔维斯之旅 1BD"},{"$f":"VLOOKUP($D:$D,基础资料!$A:D,4,0)","v":"1"},{"$f":"VLOOKUP($D:$D,基础资料!$A:E,5,0)","v":"套"},{"$f":"VLOOKUP($D:$D,基础资料!$A:F,6,0)","v":"蓝光电影"},null,null,97,{"$f":"SUMIF($D:$D,D24,$L:$L)+SUMIF($D:$D,D24,$J:$J)-SUMIF($D:$D,D24,$K:$K)","v":96},{"$f":"VLOOKUP(D:D,结存!A:J,10,0)","v":96},{"$f":"M24 - N24","v":0}]
[null,null,null,590,{"$f":"VLOOKUP($D:$D,基础资料!$A:B,2,0)","v":"07020022"},{"$f":"VLOOKUP($D:$D,基础资料!$A:C,3,0)","v":"蓝影-美国不为人知的历史 1BD"},{"$f":"VLOOKUP($D:$D,基础资料!$A:D,4,0)","v":"1"},{"$f":"VLOOKUP($D:$D,基础资料!$A:E,5,0)","v":"套"},{"$f":"VLOOKUP($D:$D,基础资料!$A:F,6,0)","v":"蓝光电影"},null,null,89,{"$f":"SUMIF($D:$D,D25,$L:$L)+SUMIF($D:$D,D25,$J:$J)-SUMIF($D:$D,D25,$K:$K)","v":88},{"$f":"VLOOKUP(D:D,结存!A:J,10,0)","v":88},{"$f":"M25 - N25","v":0}]
[null,null,null,591,{"$f":"VLOOKUP($D:$D,基础资料!$A:B,2,0)","v":"07020023"},{"$f":"VLOOKUP($D:$D,基础资料!$A:C,3,0)","v":"蓝影-绿野仙踪1BD"},{"$f":"VLOOKUP($D:$D,基础资料!$A:D,4,0)","v":"1"},{"$f":"VLOOKUP($D:$D,基础资料!$A:E,5,0)","v":"套"},{"$f":"VLOOKUP($D:$D,基础资料!$A:F,6,0)","v":"蓝光电影"},null,null,82,{"$f":"SUMIF($D:$D,D26,$L:$L)+SUMIF($D:$D,D26,$J:$J)-SUMIF($D:$D,D26,$K:$K)","v":82},{"$f":"VLOOKUP(D:D,结存!A:J,10,0)","v":82},{"$f":"M26 - N26","v":0}]
[null,null,null,596,{"$f":"VLOOKUP($D:$D,基础资料!$A:B,2,0)","v":"07020028"},{"$f":"VLOOKUP($D:$D,基础资料!$A:C,3,0)","v":"蓝影-模仿游戏1BD+1DVD"},{"$f":"VLOOKUP($D:$D,基础资料!$A:D,4,0)","v":"2"},{"$f":"VLOOKUP($D:$D,基础资料!$A:E,5,0)","v":"套"},{"$f":"VLOOKUP($D:$D,基础资料!$A:F,6,0)","v":"蓝光电影"},null,null,99,{"$f":"SUMIF($D:$D,D27,$L:$L)+SUMIF($D:$D,D27,$J:$J)-SUMIF($D:$D,D27,$K:$K)","v":99},{"$f":"VLOOKUP(D:D,结存!A:J,10,0)","v":99},{"$f":"M27 - N27","v":0}]
[null,null,null,598,{"$f":"VLOOKUP($D:$D,基础资料!$A:B,2,0)","v":"07020030"},{"$f":"VLOOKUP($D:$D,基础资料!$A:C,3,0)","v":"蓝影-金钱怪兽1BD"},{"$f":"VLOOKUP($D:$D,基础资料!$A:D,4,0)","v":"1"},{"$f":"VLOOKUP($D:$D,基础资料!$A:E,5,0)","v":"套"},{"$f":"VLOOKUP($D:$D,基础资料!$A:F,6,0)","v":"蓝光电影"},null,null,90,{"$f":"SUMIF($D:$D,D28,$L:$L)+SUMIF($D:$D,D28,$J:$J)-SUMIF($D:$D,D28,$K:$K)","v":90},{"$f":"VLOOKUP(D:D,结存!A:J,10,0)","v":90},{"$f":"M28 - N28","v":0}]
[null,null,null,599,{"$f":"VLOOKUP($D:$D,基础资料!$A:B,2,0)","v":"07020031"},{"$f":"VLOOKUP($D:$D,基础资料!$A:C,3,0)","v":"蓝影-杀死一只知更鸟1BD"},{"$f":"VLOOKUP($D:$D,基础资料!$A:D,4,0)","v":"1"},{"$f":"VLOOKUP($D:$D,基础资料!$A:E,5,0)","v":"套"},{"$f":"VLOOKUP($D:$D,基础资料!$A:F,6,0)","v":"蓝光电影"},null,null,79,{"$f":"SUMIF($D:$D,D29,$L:$L)+SUMIF($D:$D,D29,$J:$J)-SUMIF($D:$D,D29,$K:$K)","v":78},{"$f":"VLOOKUP(D:D,结存!A:J,10,0)","v":78},{"$f":"M29 - N29","v":0}]
[null,null,null,604,{"$f":"VLOOKUP($D:$D,基础资料!$A:B,2,0)","v":"07020036"},{"$f":"VLOOKUP($D:$D,基础资料!$A:C,3,0)","v":"蓝影- 喷火战斗机住在温布利球场 1BD"},{"$f":"VLOOKUP($D:$D,基础资料!$A:D,4,0)","v":"1"},{"$f":"VLOOKUP($D:$D,基础资料!$A:E,5,0)","v":"套"},{"$f":"VLOOKUP($D:$D,基础资料!$A:F,6,0)","v":"蓝光电影"},null,null,86,{"$f":"SUMIF($D:$D,D30,$L:$L)+SUMIF($D:$D,D30,$J:$J)-SUMIF($D:$D,D30,$K:$K)","v":86},{"$f":"VLOOKUP(D:D,结存!A:J,10,0)","v":86},{"$f":"M30 - N30","v":0}]
{"$rows_left_out":261}
{"sheet":"基础资料","index":3,"n_rows":320,"n_cols":9,"rows_kept":320,"cut":false,"hidden":false,"merged":[]}
["内部编号","SKU","存货名称","规格","单位","存货大类","实盘数","备注","英文名"]
[1,"0001010273","蓝光-美女与野兽第2季贝儿的心愿1DVD+1BD","2","套","调用成品",0]
[2,"0001010274","蓝光-八恶人1BD+1DVD","2","套","调用成品",0]
[3,"0001010275","蓝光-石中剑50周年版 1BD+1DVD","2","套","调用成品",0]
[4,"0001010276","蓝光-绝命毒师完整版16BD","16","套","调用成品",0]
[5,"0001010277","蓝光-詹姆斯邦德（007）完整版25BD","25","套","调用成品",0]
[6,"0001010278","蓝光战争与和平 2BD","2","套","调用成品",0]
[7,"0001010279","蓝光-猫的报恩 1BD+1DVD","2","套","调用成品",0]
[8,"0001010280","蓝光-绿箭侠第3季 4BD","4","套","调用成品",0]
[9,"0001010281","蓝光-绿箭侠第2季4BD","4","套","调用成品",0]
[10,"0001010282","蓝光-绿箭侠第1季4BD","4","套","调用成品",0]
[11,"0001010283","蓝光-迪士尼动画短片合集1BD+1DVD","2","套","调用成品",0]
[12,"0001010284","蓝光-末日孤舰第2季3BD","3","套","调用成品",0]
[13,"0001010285","蓝光-乐高大电影1BD+1DVD","2","套","调用成品",0]
[14,"0001010286","蓝光-侏罗纪公园完整版6BD","6","套","调用成品",0]
[15,"0001010287","蓝光-行尸之惧第1季2BD","2","套","调用成品",0]
[16,"0001010288","蓝光-童话镇第4季5BD","5","套","调用成品",0]
[17,"0001010289","蓝光-格林第4季 5BD","5","套","调用成品",0]
[18,"0001010290","蓝光-公主与青蛙 1BD+1DVD","2","套","调用成品",0]
[19,"0007050243","自由之歌的CD盒集4CD","\\","套","CD成品",0,null,"Songs Of Freedom"]
[20,"0007050244","迪士尼经典套装4CD","\\","套","CD成品",0,null,"Disney Classics Box Set"]
[21,"0007050245","在一个盒子里的信息：完整的录音CD盒集[ 4 ]套盒4CD","\\","套","CD成品",0,null,"Message in a Box: The Complete Recording"]
[22,"0007050246","猫王这是它的方式（旧版)2CD","\\","套","CD成品",16,null,"That`s the Way It Is"]
[23,"0007050247","《终极收藏套盒5CD","\\","套","CD成品",0,null,"The Ultimate Collection"]
[25,"0601010001","14mm蓝色4碟PP盒（蓝光）","\\","个","PP盒",0]
[26,"0601010002","14mm蓝色3碟PP盒","\\","个","PP盒",0]
[27,"0602010001","BD-R","\\","片","BD碟",0]
[28,"0602010002","KL-虞美人盛开的山坡  BD碟1","\\","片","BD碟",0,null,"From Up on Poppy Hill"]
[29,"0602010003","KL-猫王-埃尔维斯之旅 BD碟1","\\","片","BD碟",0,null,"Elvis Presley - Elvis On Tour"]
[30,"0602010004","KL-地球百子第1季 BD碟1","\\","片","BD碟",0,null,"The 100: Season 1"]
{"$rows_left_out":291}
{"sheet":"说明","index":4,"n_rows":33,"n_cols":15,"rows_kept":33,"cut":false,"hidden":false,"merged":[]}
["1 单元格变化时的事件Worksheet_Change来自动填充公式，对于vlookup函数不是很好用；"]
[null,"即使下面公式也出现一些莫名其秒的问题，如开始是填充第11列，后改到第12例，但11例还在填充。如把公式都全部删除了，还是可以有效果，奇怪了；"]
[null,"Cells(X, 12).Formula = \"=SUMIF($D:$D,D\" & X & \",$I:$I)+SUMIF($D:$D,D\" & X & \",$J:$J)-SUMIF($D:$D,D\" & X & \",$K:$K)\""]
["2 单元格变化时的事件Worksheet_Change来自动跳过公式也不是很好用；"]
["3 条件求和特别慢；"]
[null,"变通的办法是把历史数据的公式复制为值，只保留最近两天的数据的公式；"]
["4 公式备份"]
["2016-11-05","11Y0072",null,621,{"$f":"VLOOKUP($D:$D,基础资料!$A:B,2,0)","v":"0703000024"},{"$f":"VLOOKUP($D:$D,基础资料!$A:C,3,0)","v":"蓝卡愤怒的小鸟1BD+1DVD"},{"$f":"VLOOKUP($D:$D,基础资料!$A:D,4,0)","v":"1BD+1DVD"},{"$f":"VLOOKUP($D:$D,基础资料!$A:F,5,0)","v":"套"},{"$f":"VLOOKUP($D:$D,基础资料!$A:F,6,0)","v":"蓝光卡通"},500,null,null,{"$f":"SUMIF($D:$D,D8,$L:$L)+SUMIF($D:$D,D8,$J:$J)-SUMIF($D:$D,D8,$K:$K)","v":500},{"$f":"VLOOKUP(D:D,#REF!,10,0)","v":{"$error":"#REF!"}},{"$f":"M8-N8","v":{"$error":"#REF!"}}]
["5 打印页面"]
[null,"5.1 有排序（透视表的排序不是很灵活）；"]
[null,"5.2 加了一列（实点）；"]
[null,"5.3 自然有各种格式化；"]
["6 VBA过程也可以添加到快速启动栏"]
[null,"Excel选项→自定义→宏→选择一个过程；"]
["7 自定义工具栏存在的问题"]
[null,"如果是在A路径下添加的工作，复制到B路径后，发现菜单下关连的过程运行不了，需要重新更新一下工具（也就是运行一下添加菜单的过程）；"]
[]
["8 数据透视表"]
[null,"水平并排/垂直并排显示透视字段：选项→选项→布局；"]
[null,"字段名称如何去除“求和项：”"]
[null,"在“编辑栏”中删除“求和项”，再在文本的最后输入一个空格；"]
[null,null,"ActiveSheet.PivotTables(\"数据透视表1\").DataPivotField.PivotItems(\"求和项:期初数量\").Caption = \"期初数量 \""]
[null,"        "]
["9 自动刷新代码"]
[null,"ThisWorkbook.RefreshAll"]
[]
["10 刷新透视表后保持原来的和格式"]
[null,"选项→布局和格式→勾选“更新时保留单元格格式”和去掉勾选“更新时自动调整列宽”；"]
[]
["11 多重合并数据透视表"]
{"$rows_left_out":4}
{"sheet":"打印结存","index":5,"n_rows":119,"n_cols":11,"rows_kept":119,"cut":false,"hidden":false,"merged":[]}
["内部编号","SKU","存货名称","规格","单位","存货大类","期初数量","收入数量","发出数量","结存数量","实点"]
[692,"0007050305","滚石乐队15CD","\\","套","CD成品",null,98,70,{"$f":"G2+H2-I2","v":28}]
[22,"0007050246","猫王这是它的方式（旧版)2CD","\\","套","CD成品",null,20,9,11]
[689,"0701000349","奥丽芙.基特里奇2BD","\\","套","蓝光电视剧",null,98,2,96]
[533,"07010006","蓝剧-冰血暴第2季  3BD","3","套","蓝光电视剧",72,null,2,70]
[529,"0701000235","蓝剧传教士 第一季3BD","3","套","蓝光电视剧",null,96,6,90]
[538,"07010012","蓝剧-地球百子第1季 3BD","3","套","蓝光电视剧",95,null,null,95]
[526,"07010001","蓝剧-地球百子第3季 4BD","4","套","蓝光电视剧",21,null,2,19]
[536,"07010010","蓝剧-黑色孤儿第1季  2BD","2","套","蓝光电视剧",86,null,1,85]
[537,"07010011","蓝剧-黑色孤儿第2季  2BD","2","套","蓝光电视剧",85,null,6,79]
[539,"07010013","蓝剧-黑色孤儿第3季  2BD","2","套","蓝光电视剧",83,4,1,86]
[541,"07010015","蓝剧-黑色孤儿第4季  2BD","2","套","蓝光电视剧",74,null,11,63]
[527,"07010002","蓝剧-降世神通：科拉传奇 第2季 神灵2BD","2","套","蓝光电视剧",99,null,null,99]
[530,"07010003","蓝剧-降世神通：科拉传奇 第3季2BD","2","套","蓝光电视剧",99,null,null,99]
[531,"07010004","蓝剧-降世神通：科拉传奇 第4季2BD","2","套","蓝光电视剧",85,null,null,85]
[532,"07010005","蓝剧-我是僵尸第2季  4BD","4","套","蓝光电视剧",61,null,6,55]
[534,"07010008","蓝剧-我是僵尸第2季 4BD","4","套","蓝光电视剧",61,null,null,61]
[694,"0701000355","贝茨旅馆第四季2BD","\\","本","蓝光电影",null,20,20,0]
[688,9090003,"蓝光瑞壳和莫蒂第1季1BD","\\","套","蓝光电影",null,1,1,0]
[604,"07020036","蓝影- 喷火战斗机住在温布利球场 1BD","1","套","蓝光电影",86,null,null,86]
[572,"07020004","蓝影 -一切都会过去：淘儿唱片的浮与沉  1BD","1","套","蓝光电影",87,null,null,87]
[582,"07020014","蓝影 -银河护卫队  1BD","1","套","蓝光电影",77,null,null,77]
[584,"07020016","蓝影-X战警：金刚狼  6BD","6","套","蓝光电影",null,10,10,0]
[577,"07020009","蓝影-盖世枭雄1BD","1","套","蓝光电影",73,null,null,73]
[607,"07020039","蓝影-钢之炼金术师：兄弟会（上）  4BD","4","套","蓝光电影",88,null,16,72]
[608,"07020040","蓝影-钢之炼金术师：兄弟会（下）  4BD","4","套","蓝光电影",86,null,9,77]
[606,"07020038","蓝影-钢之炼金术师完整版 6BD","6","套","蓝光电影",43,null,null,43]
[578,"07020010","蓝影-功夫熊猫21BD+2DVD","3","套","蓝光电影",89,null,8,81]
[579,"07020011","蓝影-功夫熊猫3  1BD+1DVD","2","套","蓝光电影",75,null,8,67]
[609,"07020041","蓝影-海贼王剧场版10：强者天下  1BD+1DVD","2","套","蓝光电影",89,null,null,89]
{"$rows_left_out":89}