{"text_format":"1","workbook":"xlsx","n_sheets":6,"sheets":["结存","000目录","明细","基础资料","说明","打印结存"],"not_rendered":{"charts":0,"images":0,"macros":1,"external_links":0,"defined_names":3,"comments":0,"pivot_tables":1},"unopened":[],"bounds":{"document_bytes":16777216,"sheet_cells":100000,"rows_first":2000,"rows_last":500,"rows_between":2000,"halvings":0,"cell_chars":16384,"cell_head_chars":4096},"cells_cut":0,"cells_raw":0,"read":"whole","date_system":"1900"}

{"sheet":"结存","index":0,"n_rows":122,"n_cols":12,"rows_kept":122,"cut":false,"hidden":false,"merged":[]}
[null,null,null,null,null,null,"值"]
["内部编号","SKU","存货名称","规格","单位","存货大类","期初数量 ","收入数量 ","发出数量 ","结存(透视表)","结存(公式)","结存差异"]
[1,"0001010273","蓝光-美女与野兽第2季贝儿的心愿1DVD+1BD","2","套","调用成品",null,12,null,{"$f":"G3+H3-I3","v":12},{"$f":"VLOOKUP(A:A,明细!D:M,10,0)","v":12},{"$f":"J3 - K3","v":0}]
[2,"0001010274","蓝光-八恶人1BD+1DVD","2","套","调用成品",null,22,null,22,{"$f":"VLOOKUP(A:A,明细!D:M,10,0)","v":22},0]
[22,"0007050246","猫王这是它的方式（旧版)2CD","\\","套","CD成品",null,20,9,11,{"$f":"VLOOKUP(A:A,明细!D:M,10,0)","v":11},0]
[526,"07010001","蓝剧-地球百子第3季 4BD","4","套","蓝光电视剧",21,null,2,19,{"$f":"VLOOKUP(A:A,明细!D:M,10,0)","v":19},0]
[527,"07010002","蓝剧-降世神通：科拉传奇 第2季 神灵2BD","2","套","蓝光电视剧",99,null,null,99,{"$f":"VLOOKUP(A:A,明细!D:M,10,0)","v":118},-19]
[529,"0701000235","蓝剧传教士 第一季3BD","3","套","蓝光电视剧",null,96,6,90,{"$f":"VLOOKUP(A:A,明细!D:M,10,0)","v":90},0]
[530,"07010003","蓝剧-降世神通：科拉传奇 第3季2BD","2","套","蓝光电视剧",99,null,null,99,{"$f":"VLOOKUP(A:A,明细!D:M,10,0)","v":118},-19]
[531,"07010004","蓝剧-降世神通：科拉传奇 第4季2BD","2","套","蓝光电视剧",85,null,null,85,{"$f":"VLOOKUP(A:A,明细!D:M,10,0)","v":104},-19]
[532,"07010005","蓝剧-我是僵尸第2季  4BD","4","套","蓝光电视剧",61,null,6,55,{"$f":"VLOOKUP(A:A,明细!D:M,10,0)","v":55},0]
[533,"07010006","蓝剧-冰血暴第2季  3BD","3","套","蓝光电视剧",72,null,2,70,{"$f":"VLOOKUP(A:A,明细!D:M,10,0)","v":89},-19]
[534,"07010008","蓝剧-我是僵尸第2季 4BD","4","套","蓝光电视剧",61,null,null,61,{"$f":"VLOOKUP(A:A,明细!D:M,10,0)","v":80},-19]
[536,"07010010","蓝剧-黑色孤儿第1季  2BD","2","套","蓝光电视剧",86,null,1,85,{"$f":"VLOOKUP(A:A,明细!D:M,10,0)","v":104},-19]
[537,"07010011","蓝剧-黑色孤儿第2季  2BD","2","套","蓝光电视剧",85,null,6,79,{"$f":"VLOOKUP(A:A,明细!D:M,10,0)","v":98},-19]
[538,"07010012","蓝剧-地球百子第1季 3BD","3","套","蓝光电视剧",95,null,null,95,{"$f":"VLOOKUP(A:A,明细!D:M,10,0)","v":95},0]
[539,"07010013","蓝剧-黑色孤儿第3季  2BD","2","套","蓝光电视剧",83,4,1,86,{"$f":"VLOOKUP(A:A,明细!D:M,10,0)","v":86},0]
[541,"07010015","蓝剧-黑色孤儿第4季  2BD","2","套","蓝光电视剧",74,null,11,63,{"$f":"VLOOKUP(A:A,明细!D:M,10,0)","v":63},0]
[562,"0702000026","蓝影我们都为比尔着盛装1BD","1","套","蓝光电影",null,98,null,98,{"$f":"VLOOKUP(A:A,明细!D:M,10,0)","v":98},0]
[563,"0702000027","蓝影攀登梅鲁峰1BD","1","套","蓝光电影",null,2,2,0,{"$f":"VLOOKUP(A:A,明细!D:M,10,0)","v":0},0]
[568,"0702000032","蓝影年轻气盛1BD","1","套","蓝光电影",null,99,4,95,{"$f":"VLOOKUP(A:A,明细!D:M,10,0)","v":95},0]
[571,"07020003","蓝影-遇见你之前1BD+1DVD","2","套","蓝光电影",73,null,null,73,{"$f":"VLOOKUP(A:A,明细!D:M,10,0)","v":73},0]
[572,"07020004","蓝影 -一切都会过去：淘儿唱片的浮与沉  1BD","1","套","蓝光电影",87,null,null,87,{"$f":"VLOOKUP(A:A,明细!D:M,10,0)","v":87},0]
[573,"07020005","蓝影-猫王:是这样的:特别版  1BD+1DVD","2","套","蓝光电影",85,null,16,69,{"$f":"VLOOKUP(A:A,明细!D:M,10,0)","v":69},0]
[574,"07020006","蓝影-辛普森一家20周年特辑 2BD","2","套","蓝光电影",15,null,null,15,{"$f":"VLOOKUP(A:A,明细!D:M,10,0)","v":15},0]
[576,"07020008","蓝影-三傻大闹宝莱坞1BD","1","套","蓝光电影",72,null,null,72,{"$f":"VLOOKUP(A:A,明细!D:M,10,0)","v":72},0]
[577,"07020009","蓝影-盖世枭雄1BD","1","套","蓝光电影",73,null,null,73,{"$f":"VLOOKUP(A:A,明细!D:M,10,0)","v":73},0]
[578,"07020010","蓝影-功夫熊猫21BD+2DVD","3","套","蓝光电影",89,null,8,81,{"$f":"VLOOKUP(A:A,明细!D:M,10,0)","v":81},0]
[579,"07020011","蓝影-功夫熊猫3  1BD+1DVD","2","套","蓝光电影",75,null,8,67,{"$f":"VLOOKUP(A:A,明细!D:M,10,0)","v":67},0]
[582,"07020014","蓝影 -银河护卫队  1BD","1","套","蓝光电影",77,null,null,77,{"$f":"VLOOKUP(A:A,明细!D:M,10,0)","v":77},0]
[583,"07020015","蓝影-元气囝仔 2BD+2DVD","4","套","蓝光电影",98,null,4,94,{"$f":"VLOOKUP(A:A,明细!D:M,10,0)","v":94},0]
[584,"07020016","蓝影-X战警：金刚狼  6BD","6","套","蓝光电影",null,10,10,0,{"$f":"VLOOKUP(A:A,明细!D:M,10,0)","v":0},0]
[585,"07020017","蓝影-刑事  1BD+1DVD","2","套","蓝光电影",4,null,null,4,{"$f":"VLOOKUP(A:A,明细!D:M,10,0)","v":4},0]
[588,"07020020","蓝影-猫王-埃尔维斯之旅 1BD","1","套","蓝光电影",97,null,1,96,{"$f":"VLOOKUP(A:A,明细!D:M,10,0)","v":96},0]
[590,"07020022","蓝影-美国不为人知的历史 1BD","1","套","蓝光电影",89,null,1,{"$f":"G35+H35-I35","v":88},{"$f":"VLOOKUP(A:A,明细!D:M,10,0)","v":88},{"$f":"J35 - K35","v":0}]
[591,"07020023","蓝影-绿野仙踪1BD","1","套","蓝光电影",82,null,null,82,{"$f":"VLOOKUP(A:A,明细!D:M,10,0)","v":82},0]
[594,"07020026","蓝影-耐撕侦探1BD+1DVD","2","套","蓝光电影",null,98,3,95,{"$f":"VLOOKUP(A:A,明细!D:M,10,0)","v":95},0]
[596,"07020028","蓝影-模仿游戏1BD+1DVD","2","套","蓝光电影",99,null,null,99,{"$f":"VLOOKUP(A:A,明细!D:M,10,0)","v":99},0]
[598,"07020030","蓝影-金钱怪兽1BD","1","套","蓝光电影",90,null,null,90,{"$f":"VLOOKUP(A:A,明细!D:M,10,0)","v":90},0]
[599,"07020031","蓝影-杀死一只知更鸟1BD","1","套","蓝光电影",79,null,1,78,{"$f":"VLOOKUP(A:A,明细!D:M,10,0)","v":78},0]
[604,"07020036","蓝影- 喷火战斗机住在温布利球场 1BD","1","套","蓝光电影",86,null,null,86,{"$f":"VLOOKUP(A:A,明细!D:M,10,0)","v":86},0]
[605,"07020037","蓝影-鲁邦三世：卡里奥斯特罗城  1BD","1","套","蓝光电影",85,null,null,85,{"$f":"VLOOKUP(A:A,明细!D:M,10,0)","v":85},0]
[606,"07020038","蓝影-钢之炼金术师完整版 6BD","6","套","蓝光电影",43,null,null,43,{"$f":"VLOOKUP(A:A,明细!D:M,10,0)","v":43},0]
[607,"07020039","蓝影-钢之炼金术师：兄弟会（上）  4BD","4","套","蓝光电影",88,null,16,72,{"$f":"VLOOKUP(A:A,明细!D:M,10,0)","v":72},0]
[608,"07020040","蓝影-钢之炼金术师：兄弟会（下）  4BD","4","套","蓝光电影",86,null,9,77,{"$f":"VLOOKUP(A:A,明细!D:M,10,0)","v":77},0]
[609,"07020041","蓝影-海贼王剧场版10：强者天下  1BD+1DVD","2","套","蓝光电影",89,null,null,89,{"$f":"VLOOKUP(A:A,明细!D:M,10,0)","v":89},0]
[610,"07020042","蓝影-控方证人 1BD","1","套","蓝光电影",87,null,null,87,{"$f":"VLOOKUP(A:A,明细!D:M,10,0)","v":87},0]
[611,"07020043","蓝影-狼厅 3BD","3","套","蓝光电影",75,null,1,74,{"$f":"VLOOKUP(A:A,明细!D:M,10,0)","v":74},0]
[613,"07020045","蓝影-李小龙首播集  4BD","4","套","蓝光电影",65,null,null,65,{"$f":"VLOOKUP(A:A,明细!D:M,10,0)","v":65},0]
[614,"07020046","蓝影-卡罗尔1BD","1","套","蓝光电影",84,null,null,84,{"$f":"VLOOKUP(A:A,明细!D:M,10,0)","v":84},0]
[615,"07020047","蓝影-无人生还 2BD","\\","套","蓝光电影",84,null,null,84,{"$f":"VLOOKUP(A:A,明细!D:M,10,0)","v":84},0]
[621,"0703000024","蓝卡愤怒的小鸟1BD+1DVD","1BD+1DVD","套","蓝光卡通",22,732,269,485,{"$f":"VLOOKUP(A:A,明细!D:M,10,0)","v":485},0]
[624,"07030001","蓝卡-虞美人盛开的山坡  1BD+1DVD","2","套","蓝光卡通",86,null,null,86,{"$f":"VLOOKUP(A:A,明细!D:M,10,0)","v":86},0]
[625,"07030002","蓝卡-辉夜姬物语  1BD+2DVD","3","套","蓝光卡通",84,null,null,84,{"$f":"VLOOKUP(A:A,明细!D:M,10,0)","v":84},0]
[627,"07030003","蓝卡-海洋之歌1BD+1DVD","2","套","蓝光卡通",85,null,null,85,{"$f":"VLOOKUP(A:A,明细!D:M,10,0)","v":85},0]
[628,"07030004","蓝卡-怪物之子 1BD+1DVD","2","套","蓝光卡通",98,null,null,98,{"$f":"VLOOKUP(A:A,明细!D:M,10,0)","v":98},0]
[629,"07030005","蓝卡-穿越时空的少女  1BD+2DVD","3","套","蓝光卡通",77,null,null,77,{"$f":"VLOOKUP(A:A,明细!D:M,10,0)","v":77},0]
[630,"07030006","蓝卡-非凡的世界  1BD+1DVD","2","套","蓝光卡通",86,null,null,86,{"$f":"VLOOKUP(A:A,明细!D:M,10,0)","v":86},0]
[632,"07030008","蓝卡-夏日大作战  1BD+2DVD","3","套","蓝光卡通",88,null,null,88,{"$f":"VLOOKUP(A:A,明细!D:M,10,0)","v":88},0]
[633,"07030009","蓝卡-星际牛仔  4BD","4","套","蓝光卡通",19,null,10,9,{"$f":"VLOOKUP(A:A,明细!D:M,10,0)","v":9},0]
[634,"07030010","蓝卡-言叶之庭 1BD","1","套","蓝光卡通",78,null,null,78,{"$f":"VLOOKUP(A:A,明细!D:M,10,0)","v":78},0]
[635,"07030011","蓝卡-凉宫春日的消失  1BD+2DVD","\\","套","蓝光卡通",null,99,4,95,{"$f":"VLOOKUP(A:A,明细!D:M,10,0)","v":95},0]
[636,"0704000001","S-内识心理学","\\","本","书本",979,null,323,656,{"$f":"VLOOKUP(A:A,明细!D:M,10,0)","v":656},0]
[637,"0704000002","S-项目评价","\\","本","书本",45,2021,189,1877,{"$f":"VLOOKUP(A:A,明细!D:M,10,0)","v":1877},0]
[638,"0704000003","S-人格理论","\\","本","书本",586,null,63,523,{"$f":"VLOOKUP(A:A,明细!D:M,10,0)","v":523},0]
[639,"0704000004","S-电器查询","\\","本","书本",258,50,85,223,{"$f":"VLOOKUP(A:A,明细!D:M,10,0)","v":223},0]
[640,"0704000035","S-商业：一个不断变化的世界","\\","本","书本",527,null,53,{"$f":"G67+H67-I67","v":474},{"$f":"VLOOKUP(A:A,明细!D:M,10,0)","v":474},{"$f":"J67 - K67","v":0}]
[641,"0704000036","S-我们的人民","\\","本","书本",2745,null,60,2685,{"$f":"VLOOKUP(A:A,明细!D:M,10,0)","v":2685},0]
[642,"07040001","S-恐怖故事（3本一套）","\\","套","书本",91,null,56,35,{"$f":"VLOOKUP(A:A,明细!D:M,10,0)","v":35},0]
[643,"07040002","S-定量技术分析","\\","本","书本",570,null,null,570,{"$f":"VLOOKUP(A:A,明细!D:M,10,0)","v":570},0]
[644,"0704000293","S-环境经济学","\\","本","书本",555,null,136,419,{"$f":"VLOOKUP(A:A,明细!D:M,10,0)","v":419},0]
[645,"07040003","S-公共演讲的艺术","\\","本","书本",1461,null,58,1403,{"$f":"VLOOKUP(A:A,明细!D:M,10,0)","v":1403},0]
[646,"07040004","S-媒体伦理","\\","本","书本",619,null,null,619,{"$f":"VLOOKUP(A:A,明细!D:M,10,0)","v":619},0]
[647,"07040005","S-有效的小组讨论","\\","本","书本",382,null,null,382,{"$f":"VLOOKUP(A:A,明细!D:M,10,0)","v":382},0]
[648,"07040006","S-大众传媒法","\\","本","书本",94,null,75,19,{"$f":"VLOOKUP(A:A,明细!D:M,10,0)","v":19},0]
[649,"07040007","S-行为研究方法","\\","本","书本",4620,null,43,4577,{"$f":"VLOOKUP(A:A,明细!D:M,10,0)","v":4577},0]
[650,"07040008","S-谈判精要","\\","本","书本",678,null,140,538,{"$f":"VLOOKUP(A:A,明细!D:M,10,0)","v":538},0]
[651,"07040009","S-合作、协商和团队合作","\\","本","书本",314,null,3,311,{"$f":"VLOOKUP(A:A,明细!D:M,10,0)","v":311},0]
[652,"07040010","S-管理技能养成","\\","本","书本",424,null,132,292,{"$f":"VLOOKUP(A:A,明细!D:M,10,0)","v":292},0]
[653,"07040011","S-实现改变","\\","本","书本",985,null,null,985,{"$f":"VLOOKUP(A:A,明细!D:M,10,0)","v":985},0]
[654,"07040012","S-实践研究","\\","本","书本",2002,null,36,1966,{"$f":"VLOOKUP(A:A,明细!D:M,10,0)","v":1966},0]
[655,"07040013","S-校园法律","\\","本","书本",768,null,70,698,{"$f":"VLOOKUP(A:A,明细!D:M,10,0)","v":698},0]
[656,"07040014","S-伦理护理","\\","本","书本",966,null,10,956,{"$f":"VLOOKUP(A:A,明细!D:M,10,0)","v":956},0]
[657,"07040015","S-心理学","\\","本","书本",575,null,null,575,{"$f":"VLOOKUP(A:A,明细!D:M,10,0)","v":575},0]
[658,"07040016","S-四十项心理学的研究 821","\\","本","书本",251,null,250,1,{"$f":"VLOOKUP(A:A,明细!D:M,10,0)","v":1},0]
[659,"07040017","S-实习手册","\\","本","书本",934,null,null,934,{"$f":"VLOOKUP(A:A,明细!D:M,10,0)","v":934},0]
[660,"07040018","S-明了和优雅风格的教训","\\","本","书本",454,null,null,454,{"$f":"VLOOKUP(A:A,明细!D:M,10,0)","v":454},0]
[661,"07040019","S-美国药疗保健","\\","本","书本",1029,null,54,975,{"$f":"VLOOKUP(A:A,明细!D:M,10,0)","v":975},0]
[662,"07040020","S-硕士考试指南","\\","本","书本",2144,null,40,2104,{"$f":"VLOOKUP(A:A,明细!D:M,10,0)","v":2104},0]
[663,"07040021","S-面试技巧","\\","本","书本",615,null,20,595,{"$f":"VLOOKUP(A:A,明细!D:M,10,0)","v":595},0]
[664,"07040022","S-麦克的学习技巧","\\","本","书本",594,null,null,594,{"$f":"VLOOKUP(A:A,明细!D:M,10,0)","v":594},0]
[665,"07040023","S-医生的护理实践","\\","本","书本",1327,null,null,1327,{"$f":"VLOOKUP(A:A,明细!D:M,10,0)","v":1327},0]
[666,"07040024","S-社会精神","\\","本","书本",606,null,null,606,{"$f":"VLOOKUP(A:A,明细!D:M,10,0)","v":606},0]
[667,"07040025","S-临床评估工作簿","\\","本","书本",2358,null,20,2338,{"$f":"VLOOKUP(A:A,明细!D:M,10,0)","v":2338},0]
[668,"07040026","S-团体咨询","\\","本","书本",1522,1,50,1473,{"$f":"VLOOKUP(A:A,明细!D:M,10,0)","v":1473},0]
[669,"07040027","S-小屁孩日记（9本一套）","\\","套","书本",963,null,5,958,{"$f":"VLOOKUP(A:A,明细!D:M,10,0)","v":958},0]
[670,"07040028","S-上诉辩护","\\","本","书本",703,null,null,703,{"$f":"VLOOKUP(A:A,明细!D:M,10,0)","v":703},0]
[671,"07040029","S-法律研究","\\","本","书本",807,null,null,807,{"$f":"VLOOKUP(A:A,明细!D:M,10,0)","v":807},0]
[672,"07040030","S-法律写作和分析","\\","本","书本",0,1012,300,{"$f":"G99+H99-I99","v":712},{"$f":"VLOOKUP(A:A,明细!D:M,10,0)","v":712},{"$f":"J99 - K99","v":0}]
[673,"07040031","S-电子和计算机考试学习指南","\\","本","书本",719,null,null,719,{"$f":"VLOOKUP(A:A,明细!D:M,10,0)","v":719},0]
[674,"07040032","S-民事诉讼","\\","本","书本",710,null,3,707,{"$f":"VLOOKUP(A:A,明细!D:M,10,0)","v":707},0]
[675,"07040033","S-机械实践","\\","本","书本",513,null,50,463,{"$f":"VLOOKUP(A:A,明细!D:M,10,0)","v":463},0]
[676,"07040034","S-程序员考试","\\","本","书本",1422,null,10,1412,{"$f":"VLOOKUP(A:A,明细!D:M,10,0)","v":1412},0]
[677,"07040027-1","S-小屁孩日记（1/9本一套）","\\","本","书本",8,null,null,8,{"$f":"VLOOKUP(A:A,明细!D:M,10,0)","v":8},0]
[678,"07040027-2","S-小屁孩日记（2/9本一套）","\\","本","书本",1,null,null,1,{"$f":"VLOOKUP(A:A,明细!D:M,10,0)","v":1},0]
[679,"07040027-3","S-小屁孩日记（3/9本一套）","\\","本","书本",11,null,null,11,{"$f":"VLOOKUP(A:A,明细!D:M,10,0)","v":11},0]
[680,"07040027-4","S-小屁孩日记（4/9本一套）","\\","本","书本",15,null,null,15,{"$f":"VLOOKUP(A:A,明细!D:M,10,0)","v":15},0]
[681,"07040027-5","S-小屁孩日记（5/9本一套）","\\","本","书本",30,null,null,30,{"$f":"VLOOKUP(A:A,明细!D:M,10,0)","v":30},0]
[682,"07040027-6","S-小屁孩日记（6/9本一套）","\\","本","书本",570,null,null,570,{"$f":"VLOOKUP(A:A,明细!D:M,10,0)","v":570},0]
[683,"07040027-7","S-小屁孩日记（7/9本一套）","\\","本","书本",517,null,null,517,{"$f":"VLOOKUP(A:A,明细!D:M,10,0)","v":517},0]
[684,"07040027-8","S-小屁孩日记（8/9本一套）","\\","本","书本",454,null,null,454,{"$f":"VLOOKUP(A:A,明细!D:M,10,0)","v":454},0]
[685,"07040027-9","S-小屁孩日记（9/9本一套）","\\","本","书本",508,null,null,508,{"$f":"VLOOKUP(A:A,明细!D:M,10,0)","v":508},0]
[688,9090003,"蓝光瑞壳和莫蒂第1季1BD","\\","套","蓝光电影",null,1,1,0,{"$f":"VLOOKUP(A:A,明细!D:M,10,0)","v":0},0]
[689,"0701000349","奥丽芙.基特里奇2BD","\\","套","蓝光电视剧",null,98,2,96,{"$f":"VLOOKUP(A:A,明细!D:M,10,0)","v":96},0]
[690,"0703000344","瑞奇与叮当","\\","套","蓝光卡通",null,98,2,96,{"$f":"VLOOKUP(A:A,明细!D:M,10,0)","v":96},0]
[692,"0007050305","滚石乐队15CD","\\","套","CD成品",null,98,70,28,{"$f":"VLOOKUP(A:A,明细!D:M,10,0)","v":28},0]
[693,"0702000350","星际迷航3：超越星辰","\\","套","蓝光电影",null,99,82,17,{"$f":"VLOOKUP(A:A,明细!D:M,10,0)","v":17},0]
[694,"0701000355","贝茨旅馆第四季2BD","\\","本","蓝光电影",null,20,20,0,{"$f":"VLOOKUP(A:A,明细!D:M,10,0)","v":0},0]
[695,"0704000366","课程指南","\\","本","书本",null,600,40,560,{"$f":"VLOOKUP(A:A,明细!D:M,10,0)","v":560},0]
[696,"0704000368","国际业务：全球化的挑战","\\","本","书本",null,72,40,32,{"$f":"VLOOKUP(A:A,明细!D:M,10,0)","v":32},0]
["(空白)","(空白)","(空白)","(空白)","(空白)","(空白)"]
["总计",null,null,null,null,null,43829,5462,3002]

{"sheet":"000目录","index":1,"n_rows":7,"n_cols":2,"rows_kept":7,"cut":false,"hidden":false,"merged":[]}
["编号","目录"]
[1,"结存"]
[2,"明细"]
[3,"基础资料"]
[4,"说明"]
[5,"使用公式和函数"]
[6,"打印结存"]

{"sheet":"明细","index":2,"n_rows":290,"n_cols":16,"rows_kept":290,"cut":false,"hidden":false,"merged":[]}
["日期","单号","公司或部门","内部编号","SKU","存货名称","规格","单位","存货大类","收入数量","发出数量","期初数量","结存(公式）","结存(引用）","结存(比较）","备注"]
[null,null,null,526,{"$f":"VLOOKUP($D:$D,基础资料!$A:B,2,0)","v":"07010001"},{"$f":"VLOOKUP($D:$D,基础资料!$A:C,3,0)","v":"蓝剧-地球百子第3季 4BD"},{"$f":"VLOOKUP($D:$D,基础资料!$A:D,4,0)","v":"4"},{"$f":"VLOOKUP($D:$D,基础资料!$A:E,5,0)","v":"套"},{"$f":"VLOOKUP($D:$D,基础资料!$A:F,6,0)","v":"蓝光电视剧"},{"$f":"VLOOKUP(H:H,基础资料!E:G,3,0)","v":0},null,21,{"$f":"SUMIF($D:$D,D2,$L:$L)+SUMIF($D:$D,D2,$J:$J)-SUMIF($D:$D,D2,$K:$K)","v":19},{"$f":"VLOOKUP(D:D,结存!A:J,10,0)","v":19},{"$f":"M2 - N2","v":0}]
[null,null,null,527,{"$f":"VLOOKUP($D:$D,基础资料!$A:B,2,0)","v":"07010002"},{"$f":"VLOOKUP($D:$D,基础资料!$A:C,3,0)","v":"蓝剧-降世神通：科拉传奇 第2季 神灵2BD"},{"$f":"VLOOKUP($D:$D,基础资料!$A:D,4,0)","v":"2"},{"$f":"VLOOKUP($D:$D,基础资料!$A:E,5,0)","v":"套"},{"$f":"VLOOKUP($D:$D,基础资料!$A:F,6,0)","v":"蓝光电视剧"},{"$f":"VLOOKUP(I:I,基础资料!F:G,2,0)","v":19},null,99,{"$f":"SUMIF($D:$D,D3,$L:$L)+SUMIF($D:$D,D3,$J:$J)-SUMIF($D:$D,D3,$K:$K)","v":118},{"$f":"VLOOKUP(D:D,结存!A:J,10,0)","v":99},{"$f":"M3 - N3","v":19}]
[null,null,null,530,{"$f":"VLOOKUP($D:$D,基础资料!$A:B,2,0)","v":"07010003"},{"$f":"VLOOKUP($D:$D,基础资料!$A:C,3,0)","v":"蓝剧-降世神通：科拉传奇 第3季2BD"},{"$f":"VLOOKUP($D:$D,基础资料!$A:D,4,0)","v":"2"},{"$f":"VLOOKUP($D:$D,基础资料!$A:E,5,0)","v":"套"},{"$f":"VLOOKUP($D:$D,基础资料!$A:F,6,0)","v":"蓝光电视剧"},{"$f":"VLOOKUP(I:I,基础资料!F:G,2,0)","v":19},null,99,{"$f":"SUMIF($D:$D,D4,$L:$L)+SUMIF($D:$D,D4,$J:$J)-SUMIF($D:$D,D4,$K:$K)","v":118},{"$f":"VLOOKUP(D:D,结存!A:J,10,0)","v":99},{"$f":"M4 - N4","v":19}]
[null,null,null,531,{"$f":"VLOOKUP($D:$D,基础资料!$A:B,2,0)","v":"07010004"},{"$f":"VLOOKUP($D:$D,基础资料!$A:C,3,0)","v":"蓝剧-降世神通：科拉传奇 第4季2BD"},{"$f":"VLOOKUP($D:$D,基础资料!$A:D,4,0)","v":"2"},{"$f":"VLOOKUP($D:$D,基础资料!$A:E,5,0)","v":"套"},{"$f":"VLOOKUP($D:$D,基础资料!$A:F,6,0)","v":"蓝光电视剧"},{"$f":"VLOOKUP(I:I,基础资料!F:G,2,0)","v":19},null,85,{"$f":"SUMIF($D:$D,D5,$L:$L)+SUMIF($D:$D,D5,$J:$J)-SUMIF($D:$D,D5,$K:$K)","v":104},{"$f":"VLOOKUP(D:D,结存!A:J,10,0)","v":85},{"$f":"M5 - N5","v":19}]
[null,null,null,533,{"$f":"VLOOKUP($D:$D,基础资料!$A:B,2,0)","v":"07010006"},{"$f":"VLOOKUP($D:$D,基础资料!$A:C,3,0)","v":"蓝剧-冰血暴第2季  3BD"},{"$f":"VLOOKUP($D:$D,基础资料!$A:D,4,0)","v":"3"},{"$f":"VLOOKUP($D:$D,基础资料!$A:E,5,0)","v":"套"},{"$f":"VLOOKUP($D:$D,基础资料!$A:F,6,0)","v":"蓝光电视剧"},{"$f":"VLOOKUP(I:I,基础资料!F:G,2,0)","v":19},null,72,{"$f":"SUMIF($D:$D,D6,$L:$L)+SUMIF($D:$D,D6,$J:$J)-SUMIF($D:$D,D6,$K:$K)","v":89},{"$f":"VLOOKUP(D:D,结存!A:J,10,0)","v":70},{"$f":"M6 - N6","v":19}]
[null,null,null,534,{"$f":"VLOOKUP($D:$D,基础资料!$A:B,2,0)","v":"07010008"},{"$f":"VLOOKUP($D:$D,基础资料!$A:C,3,0)","v":"蓝剧-我是僵尸第2季 4BD"},{"$f":"VLOOKUP($D:$D,基础资料!$A:D,4,0)","v":"4"},{"$f":"VLOOKUP($D:$D,基础资料!$A:E,5,0)","v":"套"},{"$f":"VLOOKUP($D:$D,基础资料!$A:F,6,0)","v":"蓝光电视剧"},{"$f":"VLOOKUP(I:I,基础资料!F:G,2,0)","v":19},null,61,{"$f":"SUMIF($D:$D,D7,$L:$L)+SUMIF($D:$D,D7,$J:$J)-SUMIF($D:$D,D7,$K:$K)","v":80},{"$f":"VLOOKUP(D:D,结存!A:J,10,0)","v":61},{"$f":"M7 - N7","v":19}]
[null,null,null,536,{"$f":"VLOOKUP($D:$D,基础资料!$A:B,2,0)","v":"07010010"},{"$f":"VLOOKUP($D:$D,基础资料!$A:C,3,0)","v":"蓝剧-黑色孤儿第1季  2BD"},{"$f":"VLOOKUP($D:$D,基础资料!$A:D,4,0)","v":"2"},{"$f":"VLOOKUP($D:$D,基础资料!$A:E,5,0)","v":"套"},{"$f":"VLOOKUP($D:$D,基础资料!$A:F,6,0)","v":"蓝光电视剧"},{"$f":"VLOOKUP(I:I,基础资料!F:G,2,0)","v":19},null,86,{"$f":"SUMIF($D:$D,D8,$L:$L)+SUMIF($D:$D,D8,$J:$J)-SUMIF($D:$D,D8,$K:$K)","v":104},{"$f":"VLOOKUP(D:D,结存!A:J,10,0)","v":85},{"$f":"M8 - N8","v":19}]
[null,null,null,537,{"$f":"VLOOKUP($D:$D,基础资料!$A:B,2,0)","v":"07010011"},{"$f":"VLOOKUP($D:$D,基础资料!$A:C,3,0)","v":"蓝剧-黑色孤儿第2季  2BD"},{"$f":"VLOOKUP($D:$D,基础资料!$A:D,4,0)","v":"2"},{"$f":"VLOOKUP($D:$D,基础资料!$A:E,5,0)","v":"套"},{"$f":"VLOOKUP($D:$D,基础资料!$A:F,6,0)","v":"蓝光电视剧"},{"$f":"VLOOKUP(I:I,基础资料!F:G,2,0)","v":19},null,85,{"$f":"SUMIF($D:$D,D9,$L:$L)+SUMIF($D:$D,D9,$J:$J)-SUMIF($D:$D,D9,$K:$K)","v":98},{"$f":"VLOOKUP(D:D,结存!A:J,10,0)","v":79},{"$f":"M9 - N9","v":19}]
[null,null,null,538,{"$f":"VLOOKUP($D:$D,基础资料!$A:B,2,0)","v":"07010012"},{"$f":"VLOOKUP($D:$D,基础资料!$A:C,3,0)","v":"蓝剧-地球百子第1季 3BD"},{"$f":"VLOOKUP($D:$D,基础资料!$A:D,4,0)","v":"3"},{"$f":"VLOOKUP($D:$D,基础资料!$A:E,5,0)","v":"套"},{"$f":"VLOOKUP($D:$D,基础资料!$A:F,6,0)","v":"蓝光电视剧"},null,null,95,{"$f":"SUMIF($D:$D,D10,$L:$L)+SUMIF($D:$D,D10,$J:$J)-SUMIF($D:$D,D10,$K:$K)","v":95},{"$f":"VLOOKUP(D:D,结存!A:J,10,0)","v":95},{"$f":"M10 - N10","v":0}]
[null,null,null,539,{"$f":"VLOOKUP($D:$D,基础资料!$A:B,2,0)","v":"07010013"},{"$f":"VLOOKUP($D:$D,基础资料!$A:C,3,0)","v":"蓝剧-黑色孤儿第3季  2BD"},{"$f":"VLOOKUP($D:$D,基础资料!$A:D,4,0)","v":"2"},{"$f":"VLOOKUP($D:$D,基础资料!$A:E,5,0)","v":"套"},{"$f":"VLOOKUP($D:$D,基础资料!$A:F,6,0)","v":"蓝光电视剧"},null,null,83,{"$f":"SUMIF($D:$D,D11,$L:$L)+SUMIF($D:$D,D11,$J:$J)-SUMIF($D:$D,D11,$K:$K)","v":86},{"$f":"VLOOKUP(D:D,结存!A:J,10,0)","v":86},{"$f":"M11 - N11","v":0}]
[null,null,null,541,{"$f":"VLOOKUP($D:$D,基础资料!$A:B,2,0)","v":"07010015"},{"$f":"VLOOKUP($D:$D,基础资料!$A:C,3,0)","v":"蓝剧-黑色孤儿第4季  2BD"},{"$f":"VLOOKUP($D:$D,基础资料!$A:D,4,0)","v":"2"},{"$f":"VLOOKUP($D:$D,基础资料!$A:E,5,0)","v":"套"},{"$f":"VLOOKUP($D:$D,基础资料!$A:F,6,0)","v":"蓝光电视剧"},null,null,74,{"$f":"SUMIF($D:$D,D12,$L:$L)+SUMIF($D:$D,D12,$J:$J)-SUMIF($D:$D,D12,$K:$K)","v":63},{"$f":"VLOOKUP(D:D,结存!A:J,10,0)","v":63},{"$f":"M12 - N12","v":0}]
[null,null,null,571,{"$f":"VLOOKUP($D:$D,基础资料!$A:B,2,0)","v":"07020003"},{"$f":"VLOOKUP($D:$D,基础资料!$A:C,3,0)","v":"蓝影-遇见你之前1BD+1DVD"},{"$f":"VLOOKUP($D:$D,基础资料!$A:D,4,0)","v":"2"},{"$f":"VLOOKUP($D:$D,基础资料!$A:E,5,0)","v":"套"},{"$f":"VLOOKUP($D:$D,基础资料!$A:F,6,0)","v":"蓝光电影"},null,null,73,{"$f":"SUMIF($D:$D,D13,$L:$L)+SUMIF($D:$D,D13,$J:$J)-SUMIF($D:$D,D13,$K:$K)","v":73},{"$f":"VLOOKUP(D:D,结存!A:J,10,0)","v":73},{"$f":"M13 - N13","v":0}]
[null,null,null,572,{"$f":"VLOOKUP($D:$D,基础资料!$A:B,2,0)","v":"07020004"},{"$f":"VLOOKUP($D:$D,基础资料!$A:C,3,0)","v":"蓝影 -一切都会过去：淘儿唱片的浮与沉  1BD"},{"$f":"VLOOKUP($D:$D,基础资料!$A:D,4,0)","v":"1"},{"$f":"VLOOKUP($D:$D,基础资料!$A:E,5,0)","v":"套"},{"$f":"VLOOKUP($D:$D,基础资料!$A:F,6,0)","v":"蓝光电影"},{"$f":"VLOOKUP($D:$D,基础资料!$A:G,3,0)","v":"蓝影 -一切都会过去：淘儿唱片的浮与沉  1BD"},null,87,{"$f":"SUMIF($D:$D,D14,$L:$L)+SUMIF($D:$D,D14,$J:$J)-SUMIF($D:$D,D14,$K:$K)","v":87},{"$f":"VLOOKUP(D:D,结存!A:J,10,0)","v":87},{"$f":"M14 - N14","v":0}]
[null,null,null,573,{"$f":"VLOOKUP($D:$D,基础资料!$A:B,2,0)","v":"07020005"},{"$f":"VLOOKUP($D:$D,基础资料!$A:C,3,0)","v":"蓝影-猫王:是这样的:特别版  1BD+1DVD"},{"$f":"VLOOKUP($D:$D,基础资料!$A:D,4,0)","v":"2"},{"$f":"VLOOKUP($D:$D,基础资料!$A:E,5,0)","v":"套"},{"$f":"VLOOKUP($D:$D,基础资料!$A:F,6,0)","v":"蓝光电影"},null,null,85,{"$f":"SUMIF($D:$D,D15,$L:$L)+SUMIF($D:$D,D15,$J:$J)-SUMIF($D:$D,D15,$K:$K)","v":69},{"$f":"VLOOKUP(D:D,结存!A:J,10,0)","v":69},{"$f":"M15 - N15","v":0}]
[null,null,null,574,{"$f":"VLOOKUP($D:$D,基础资料!$A:B,2,0)","v":"07020006"},{"$f":"VLOOKUP($D:$D,基础资料!$A:C,3,0)","v":"蓝影-辛普森一家20周年特辑 2BD"},{"$f":"VLOOKUP($D:$D,基础资料!$A:D,4,0)","v":"2"},{"$f":"VLOOKUP($D:$D,基础资料!$A:E,5,0)","v":"套"},{"$f":"VLOOKUP($D:$D,基础资料!$A:F,6,0)","v":"蓝光电影"},null,null,15,{"$f":"SUMIF($D:$D,D16,$L:$L)+SUMIF($D:$D,D16,$J:$J)-SUMIF($D:$D,D16,$K:$K)","v":15},{"$f":"VLOOKUP(D:D,结存!A:J,10,0)","v":15},{"$f":"M16 - N16","v":0}]
[null,null,null,576,{"$f":"VLOOKUP($D:$D,基础资料!$A:B,2,0)","v":"07020008"},{"$f":"VLOOKUP($D:$D,基础资料!$A:C,3,0)","v":"蓝影-三傻大闹宝莱坞1BD"},{"$f":"VLOOKUP($D:$D,基础资料!$A:D,4,0)","v":"1"},{"$f":"VLOOKUP($D:$D,基础资料!$A:E,5,0)","v":"套"},{"$f":"VLOOKUP($D:$D,基础资料!$A:F,6,0)","v":"蓝光电影"},null,null,72,{"$f":"SUMIF($D:$D,D17,$L:$L)+SUMIF($D:$D,D17,$J:$J)-SUMIF($D:$D,D17,$K:$K)","v":72},{"$f":"VLOOKUP(D:D,结存!A:J,10,0)","v":72},{"$f":"M17 - N17","v":0}]
[null,null,null,577,{"$f":"VLOOKUP($D:$D,基础资料!$A:B,2,0)","v":"07020009"},{"$f":"VLOOKUP($D:$D,基础资料!$A:C,3,0)","v":"蓝影-盖世枭雄1BD"},{"$f":"VLOOKUP($D:$D,基础资料!$A:D,4,0)","v":"1"},{"$f":"VLOOKUP($D:$D,基础资料!$A:E,5,0)","v":"套"},{"$f":"VLOOKUP($D:$D,基础资料!$A:F,6,0)","v":"蓝光电影"},null,null,73,{"$f":"SUMIF($D:$D,D18,$L:$L)+SUMIF($D:$D,D18,$J:$J)-SUMIF($D:$D,D18,$K:$K)","v":73},{"$f":"VLOOKUP(D:D,结存!A:J,10,0)","v":73},{"$f":"M18 - N18","v":0}]
[null,null,null,578,{"$f":"VLOOKUP($D:$D,基础资料!$A:B,2,0)","v":"07020010"},{"$f":"VLOOKUP($D:$D,基础资料!$A:C,3,0)","v":"蓝影-功夫熊猫21BD+2DVD"},{"$f":"VLOOKUP($D:$D,基础资料!$A:D,4,0)","v":"3"},{"$f":"VLOOKUP($D:$D,基础资料!$A:E,5,0)","v":"套"},{"$f":"VLOOKUP($D:$D,基础资料!$A:F,6,0)","v":"蓝光电影"},null,null,89,{"$f":"SUMIF($D:$D,D19,$L:$L)+SUMIF($D:$D,D19,$J:$J)-SUMIF($D:$D,D19,$K:$K)","v":81},{"$f":"VLOOKUP(D:D,结存!A:J,10,0)","v":81},{"$f":"M19 - N19","v":0}]
[null,null,null,579,{"$f":"VLOOKUP($D:$D,基础资料!$A:B,2,0)","v":"07020011"},{"$f":"VLOOKUP($D:$D,基础资料!$A:C,3,0)","v":"蓝影-功夫熊猫3  1BD+1DVD"},{"$f":"VLOOKUP($D:$D,基础资料!$A:D,4,0)","v":"2"},{"$f":"VLOOKUP($D:$D,基础资料!$A:E,5,0)","v":"套"},{"$f":"VLOOKUP($D:$D,基础资料!$A:F,6,0)","v":"蓝光电影"},null,null,75,{"$f":"SUMIF($D:$D,D20,$L:$L)+SUMIF($D:$D,D20,$J:$J)-SUMIF($D:$D,D20,$K:$K)","v":67},{"$f":"VLOOKUP(D:D,结存!A:J,10,0)","v":67},{"$f":"M20 - N20","v":0}]
[null,null,null,582,{"$f":"VLOOKUP($D:$D,基础资料!$A:B,2,0)","v":"07020014"},{"$f":"VLOOKUP($D:$D,基础资料!$A:C,3,0)","v":"蓝影 -银河护卫队  1BD"},{"$f":"VLOOKUP($D:$D,基础资料!$A:D,4,0)","v":"1"},{"$f":"VLOOKUP($D:$D,基础资料!$A:E,5,0)","v":"套"},{"$f":"VLOOKUP($D:$D,基础资料!$A:F,6,0)","v":"蓝光电影"},null,null,77,{"$f":"SUMIF($D:$D,D21,$L:$L)+SUMIF($D:$D,D21,$J:$J)-SUMIF($D:$D,D21,$K:$K)","v":77},{"$f":"VLOOKUP(D:D,结存!A:J,10,0)","v":77},{"$f":"M21 - N21","v":0}]
[null,null,null,583,{"$f":"VLOOKUP($D:$D,基础资料!$A:B,2,0)","v":"07020015"},{"$f":"VLOOKUP($D:$D,基础资料!$A:C,3,0)","v":"蓝影-元气囝仔 2BD+2DVD"},{"$f":"VLOOKUP($D:$D,基础资料!$A:D,4,0)","v":"4"},{"$f":"VLOOKUP($D:$D,基础资料!$A:E,5,0)","v":"套"},{"$f":"VLOOKUP($D:$D,基础资料!$A:F,6,0)","v":"蓝光电影"},null,null,98,{"$f":"SUMIF($D:$D,D22,$L:$L)+SUMIF($D:$D,D22,$J:$J)-SUMIF($D:$D,D22,$K:$K)","v":94},{"$f":"VLOOKUP(D:D,结存!A:J,10,0)","v":94},{"$f":"M22 - N22","v":0}]
[null,null,null,585,{"$f":"VLOOKUP($D:$D,基础资料!$A:B,2,0)","v":"07020017"},{"$f":"VLOOKUP($D:$D,基础资料!$A:C,3,0)","v":"蓝影-刑事  1BD+1DVD"},{"$f":"VLOOKUP($D:$D,基础资料!$A:D,4,0)","v":"2"},{"$f":"VLOOKUP($D:$D,基础资料!$A:E,5,0)","v":"套"},{"$f":"VLOOKUP($D:$D,基础资料!$A:F,6,0)","v":"蓝光电影"},null,null,4,{"$f":"SUMIF($D:$D,D23,$L:$L)+SUMIF($D:$D,D23,$J:$J)-SUMIF($D:$D,D23,$K:$K)","v":4},{"$f":"VLOOKUP(D:D,结存!A:J,10,0)","v":4},{"$f":"M23 - N23","v":0}]
[null,null,null,588,{"$f":"VLOOKUP($D:$D,基础资料!$A:B,2,0)","v":"07020020"},{"$f":"VLOOKUP($D:$D,基础资料!$A:C,3,0)","v":"蓝影-猫王-埃尔维斯之旅 1BD"},{"$f":"VLOOKUP($D:$D,基础资料!$A:D,4,0)","v":"1"},{"$f":"VLOOKUP($D:$D,基础资料!$A:E,5,0)","v":"套"},{"$f":"VLOOKUP($D:$D,基础资料!$A:F,6,0)","v":"蓝光电影"},null,null,97,{"$f":"SUMIF($D:$D,D24,$L:$L)+SUMIF($D:$D,D24,$J:$J)-SUMIF($D:$D,D24,$K:$K)","v":96},{"$f":"VLOOKUP(D:D,结存!A:J,10,0)","v":96},{"$f":"M24 - N24","v":0}]
[null,null,null,590,{"$f":"VLOOKUP($D:$D,基础资料!$A:B,2,0)","v":"07020022"},{"$f":"VLOOKUP($D:$D,基础资料!$A:C,3,0)","v":"蓝影-美国不为人知的历史 1BD"},{"$f":"VLOOKUP($D:$D,基础资料!$A:D,4,0)","v":"1"},{"$f":"VLOOKUP($D:$D,基础资料!$A:E,5,0)","v":"套"},{"$f":"VLOOKUP($D:$D,基础资料!$A:F,6,0)","v":"蓝光电影"},null,null,89,{"$f":"SUMIF($D:$D,D25,$L:$L)+SUMIF($D:$D,D25,$J:$J)-SUMIF($D:$D,D25,$K:$K)","v":88},{"$f":"VLOOKUP(D:D,结存!A:J,10,0)","v":88},{"$f":"M25 - N25","v":0}]
[null,null,null,591,{"$f":"VLOOKUP($D:$D,基础资料!$A:B,2,0)","v":"07020023"},{"$f":"VLOOKUP($D:$D,基础资料!$A:C,3,0)","v":"蓝影-绿野仙踪1BD"},{"$f":"VLOOKUP($D:$D,基础资料!$A:D,4,0)","v":"1"},{"$f":"VLOOKUP($D:$D,基础资料!$A:E,5,0)","v":"套"},{"$f":"VLOOKUP($D:$D,基础资料!$A:F,6,0)","v":"蓝光电影"},null,null,82,{"$f":"SUMIF($D:$D,D26,$L:$L)+SUMIF($D:$D,D26,$J:$J)-SUMIF($D:$D,D26,$K:$K)","v":82},{"$f":"VLOOKUP(D:D,结存!A:J,10,0)","v":82},{"$f":"M26 - N26","v":0}]
[null,null,null,596,{"$f":"VLOOKUP($D:$D,基础资料!$A:B,2,0)","v":"07020028"},{"$f":"VLOOKUP($D:$D,基础资料!$A:C,3,0)","v":"蓝影-模仿游戏1BD+1DVD"},{"$f":"VLOOKUP($D:$D,基础资料!$A:D,4,0)","v":"2"},{"$f":"VLOOKUP($D:$D,基础资料!$A:E,5,0)","v":"套"},{"$f":"VLOOKUP($D:$D,基础资料!$A:F,6,0)","v":"蓝光电影"},null,null,99,{"$f":"SUMIF($D:$D,D27,$L:$L)+SUMIF($D:$D,D27,$J:$J)-SUMIF($D:$D,D27,$K:$K)","v":99},{"$f":"VLOOKUP(D:D,结存!A:J,10,0)","v":99},{"$f":"M27 - N27","v":0}]
[null,null,null,598,{"$f":"VLOOKUP($D:$D,基础资料!$A:B,2,0)","v":"07020030"},{"$f":"VLOOKUP($D:$D,基础资料!$A:C,3,0)","v":"蓝影-金钱怪兽1BD"},{"$f":"VLOOKUP($D:$D,基础资料!$A:D,4,0)","v":"1"},{"$f":"VLOOKUP($D:$D,基础资料!$A:E,5,0)","v":"套"},{"$f":"VLOOKUP($D:$D,基础资料!$A:F,6,0)","v":"蓝光电影"},null,null,90,{"$f":"SUMIF($D:$D,D28,$L:$L)+SUMIF($D:$D,D28,$J:$J)-SUMIF($D:$D,D28,$K:$K)","v":90},{"$f":"VLOOKUP(D:D,结存!A:J,10,0)","v":90},{"$f":"M28 - N28","v":0}]
[null,null,null,599,{"$f":"VLOOKUP($D:$D,基础资料!$A:B,2,0)","v":"07020031"},{"$f":"VLOOKUP($D:$D,基础资料!$A:C,3,0)","v":"蓝影-杀死一只知更鸟1BD"},{"$f":"VLOOKUP($D:$D,基础资料!$A:D,4,0)","v":"1"},{"$f":"VLOOKUP($D:$D,基础资料!$A:E,5,0)","v":"套"},{"$f":"VLOOKUP($D:$D,基础资料!$A:F,6,0)","v":"蓝光电影"},null,null,79,{"$f":"SUMIF($D:$D,D29,$L:$L)+SUMIF($D:$D,D29,$J:$J)-SUMIF($D:$D,D29,$K:$K)","v":78},{"$f":"VLOOKUP(D:D,结存!A:J,10,0)","v":78},{"$f":"M29 - N29","v":0}]
[null,null,null,604,{"$f":"VLOOKUP($D:$D,基础资料!$A:B,2,0)","v":"07020036"},{"$f":"VLOOKUP($D:$D,基础资料!$A:C,3,0)","v":"蓝影- 喷火战斗机住在温布利球场 1BD"},{"$f":"VLOOKUP($D:$D,基础资料!$A:D,4,0)","v":"1"},{"$f":"VLOOKUP($D:$D,基础资料!$A:E,5,0)","v":"套"},{"$f":"VLOOKUP($D:$D,基础资料!$A:F,6,0)","v":"蓝光电影"},null,null,86,{"$f":"SUMIF($D:$D,D30,$L:$L)+SUMIF($D:$D,D30,$J:$J)-SUMIF($D:$D,D30,$K:$K)","v":86},{"$f":"VLOOKUP(D:D,结存!A:J,10,0)","v":86},{"$f":"M30 - N30","v":0}]
[null,null,null,605,{"$f":"VLOOKUP($D:$D,基础资料!$A:B,2,0)","v":"07020037"},{"$f":"VLOOKUP($D:$D,基础资料!$A:C,3,0)","v":"蓝影-鲁邦三世：卡里奥斯特罗城  1BD"},{"$f":"VLOOKUP($D:$D,基础资料!$A:D,4,0)","v":"1"},{"$f":"VLOOKUP($D:$D,基础资料!$A:E,5,0)","v":"套"},{"$f":"VLOOKUP($D:$D,基础资料!$A:F,6,0)","v":"蓝光电影"},null,null,85,{"$f":"SUMIF($D:$D,D31,$L:$L)+SUMIF($D:$D,D31,$J:$J)-SUMIF($D:$D,D31,$K:$K)","v":85},{"$f":"VLOOKUP(D:D,结存!A:J,10,0)","v":85},{"$f":"M31 - N31","v":0}]
[null,null,null,606,{"$f":"VLOOKUP($D:$D,基础资料!$A:B,2,0)","v":"07020038"},{"$f":"VLOOKUP($D:$D,基础资料!$A:C,3,0)","v":"蓝影-钢之炼金术师完整版 6BD"},{"$f":"VLOOKUP($D:$D,基础资料!$A:D,4,0)","v":"6"},{"$f":"VLOOKUP($D:$D,基础资料!$A:E,5,0)","v":"套"},{"$f":"VLOOKUP($D:$D,基础资料!$A:F,6,0)","v":"蓝光电影"},null,null,43,{"$f":"SUMIF($D:$D,D32,$L:$L)+SUMIF($D:$D,D32,$J:$J)-SUMIF($D:$D,D32,$K:$K)","v":43},{"$f":"VLOOKUP(D:D,结存!A:J,10,0)","v":43},{"$f":"M32 - N32","v":0}]
[null,null,null,607,{"$f":"VLOOKUP($D:$D,基础资料!$A:B,2,0)","v":"07020039"},{"$f":"VLOOKUP($D:$D,基础资料!$A:C,3,0)","v":"蓝影-钢之炼金术师：兄弟会（上）  4BD"},{"$f":"VLOOKUP($D:$D,基础资料!$A:D,4,0)","v":"4"},{"$f":"VLOOKUP($D:$D,基础资料!$A:E,5,0)","v":"套"},{"$f":"VLOOKUP($D:$D,基础资料!$A:F,6,0)","v":"蓝光电影"},null,null,88,{"$f":"SUMIF($D:$D,D33,$L:$L)+SUMIF($D:$D,D33,$J:$J)-SUMIF($D:$D,D33,$K:$K)","v":72},{"$f":"VLOOKUP(D:D,结存!A:J,10,0)","v":72},{"$f":"M33 - N33","v":0}]
[null,null,null,608,{"$f":"VLOOKUP($D:$D,基础资料!$A:B,2,0)","v":"07020040"},{"$f":"VLOOKUP($D:$D,基础资料!$A:C,3,0)","v":"蓝影-钢之炼金术师：兄弟会（下）  4BD"},{"$f":"VLOOKUP($D:$D,基础资料!$A:D,4,0)","v":"4"},{"$f":"VLOOKUP($D:$D,基础资料!$A:E,5,0)","v":"套"},{"$f":"VLOOKUP($D:$D,基础资料!$A:F,6,0)","v":"蓝光电影"},null,null,86,{"$f":"SUMIF($D:$D,D34,$L:$L)+SUMIF($D:$D,D34,$J:$J)-SUMIF($D:$D,D34,$K:$K)","v":77},{"$f":"VLOOKUP(D:D,结存!A:J,10,0)","v":77},{"$f":"M34 - N34","v":0}]
[null,null,null,609,{"$f":"VLOOKUP($D:$D,基础资料!$A:B,2,0)","v":"07020041"},{"$f":"VLOOKUP($D:$D,基础资料!$A:C,3,0)","v":"蓝影-海贼王剧场版10：强者天下  1BD+1DVD"},{"$f":"VLOOKUP($D:$D,基础资料!$A:D,4,0)","v":"2"},{"$f":"VLOOKUP($D:$D,基础资料!$A:E,5,0)","v":"套"},{"$f":"VLOOKUP($D:$D,基础资料!$A:F,6,0)","v":"蓝光电影"},null,null,89,{"$f":"SUMIF($D:$D,D35,$L:$L)+SUMIF($D:$D,D35,$J:$J)-SUMIF($D:$D,D35,$K:$K)","v":89},{"$f":"VLOOKUP(D:D,结存!A:J,10,0)","v":89},{"$f":"M35 - N35","v":0}]
[null,null,null,610,{"$f":"VLOOKUP($D:$D,基础资料!$A:B,2,0)","v":"07020042"},{"$f":"VLOOKUP($D:$D,基础资料!$A:C,3,0)","v":"蓝影-控方证人 1BD"},{"$f":"VLOOKUP($D:$D,基础资料!$A:D,4,0)","v":"1"},{"$f":"VLOOKUP($D:$D,基础资料!$A:E,5,0)","v":"套"},{"$f":"VLOOKUP($D:$D,基础资料!$A:F,6,0)","v":"蓝光电影"},null,null,87,{"$f":"SUMIF($D:$D,D36,$L:$L)+SUMIF($D:$D,D36,$J:$J)-SUMIF($D:$D,D36,$K:$K)","v":87},{"$f":"VLOOKUP(D:D,结存!A:J,10,0)","v":87},{"$f":"M36 - N36","v":0}]
[null,null,null,611,{"$f":"VLOOKUP($D:$D,基础资料!$A:B,2,0)","v":"07020043"},{"$f":"VLOOKUP($D:$D,基础资料!$A:C,3,0)","v":"蓝影-狼厅 3BD"},{"$f":"VLOOKUP($D:$D,基础资料!$A:D,4,0)","v":"3"},{"$f":"VLOOKUP($D:$D,基础资料!$A:E,5,0)","v":"套"},{"$f":"VLOOKUP($D:$D,基础资料!$A:F,6,0)","v":"蓝光电影"},null,null,75,{"$f":"SUMIF($D:$D,D37,$L:$L)+SUMIF($D:$D,D37,$J:$J)-SUMIF($D:$D,D37,$K:$K)","v":74},{"$f":"VLOOKUP(D:D,结存!A:J,10,0)","v":74},{"$f":"M37 - N37","v":0}]
[null,null,null,613,{"$f":"VLOOKUP($D:$D,基础资料!$A:B,2,0)","v":"07020045"},{"$f":"VLOOKUP($D:$D,基础资料!$A:C,3,0)","v":"蓝影-李小龙首播集  4BD"},{"$f":"VLOOKUP($D:$D,基础资料!$A:D,4,0)","v":"4"},{"$f":"VLOOKUP($D:$D,基础资料!$A:E,5,0)","v":"套"},{"$f":"VLOOKUP($D:$D,基础资料!$A:F,6,0)","v":"蓝光电影"},null,null,65,{"$f":"SUMIF($D:$D,D38,$L:$L)+SUMIF($D:$D,D38,$J:$J)-SUMIF($D:$D,D38,$K:$K)","v":65},{"$f":"VLOOKUP(D:D,结存!A:J,10,0)","v":65},{"$f":"M38 - N38","v":0}]
[null,null,null,614,{"$f":"VLOOKUP($D:$D,基础资料!$A:B,2,0)","v":"07020046"},{"$f":"VLOOKUP($D:$D,基础资料!$A:C,3,0)","v":"蓝影-卡罗尔1BD"},{"$f":"VLOOKUP($D:$D,基础资料!$A:D,4,0)","v":"1"},{"$f":"VLOOKUP($D:$D,基础资料!$A:E,5,0)","v":"套"},{"$f":"VLOOKUP($D:$D,基础资料!$A:F,6,0)","v":"蓝光电影"},null,null,84,{"$f":"SUMIF($D:$D,D39,$L:$L)+SUMIF($D:$D,D39,$J:$J)-SUMIF($D:$D,D39,$K:$K)","v":84},{"$f":"VLOOKUP(D:D,结存!A:J,10,0)","v":84},{"$f":"M39 - N39","v":0}]
[null,null,null,615,{"$f":"VLOOKUP($D:$D,基础资料!$A:B,2,0)","v":"07020047"},{"$f":"VLOOKUP($D:$D,基础资料!$A:C,3,0)","v":"蓝影-无人生还 2BD"},{"$f":"VLOOKUP($D:$D,基础资料!$A:D,4,0)","v":"\\"},{"$f":"VLOOKUP($D:$D,基础资料!$A:E,5,0)","v":"套"},{"$f":"VLOOKUP($D:$D,基础资料!$A:F,6,0)","v":"蓝光电影"},null,null,84,{"$f":"SUMIF($D:$D,D40,$L:$L)+SUMIF($D:$D,D40,$J:$J)-SUMIF($D:$D,D40,$K:$K)","v":84},{"$f":"VLOOKUP(D:D,结存!A:J,10,0)","v":84},{"$f":"M40 - N40","v":0}]
[null,null,null,624,{"$f":"VLOOKUP($D:$D,基础资料!$A:B,2,0)","v":"07030001"},{"$f":"VLOOKUP($D:$D,基础资料!$A:C,3,0)","v":"蓝卡-虞美人盛开的山坡  1BD+1DVD"},{"$f":"VLOOKUP($D:$D,基础资料!$A:D,4,0)","v":"2"},{"$f":"VLOOKUP($D:$D,基础资料!$A:E,5,0)","v":"套"},{"$f":"VLOOKUP($D:$D,基础资料!$A:F,6,0)","v":"蓝光卡通"},null,null,86,{"$f":"SUMIF($D:$D,D41,$L:$L)+SUMIF($D:$D,D41,$J:$J)-SUMIF($D:$D,D41,$K:$K)","v":86},{"$f":"VLOOKUP(D:D,结存!A:J,10,0)","v":86},{"$f":"M41 - N41","v":0}]
[null,null,null,625,{"$f":"VLOOKUP($D:$D,基础资料!$A:B,2,0)","v":"07030002"},{"$f":"VLOOKUP($D:$D,基础资料!$A:C,3,0)","v":"蓝卡-辉夜姬物语  1BD+2DVD"},{"$f":"VLOOKUP($D:$D,基础资料!$A:D,4,0)","v":"3"},{"$f":"VLOOKUP($D:$D,基础资料!$A:E,5,0)","v":"套"},{"$f":"VLOOKUP($D:$D,基础资料!$A:F,6,0)","v":"蓝光卡通"},null,null,84,{"$f":"SUMIF($D:$D,D42,$L:$L)+SUMIF($D:$D,D42,$J:$J)-SUMIF($D:$D,D42,$K:$K)","v":84},{"$f":"VLOOKUP(D:D,结存!A:J,10,0)","v":84},{"$f":"M42 - N42","v":0}]
[null,null,null,627,{"$f":"VLOOKUP($D:$D,基础资料!$A:B,2,0)","v":"07030003"},{"$f":"VLOOKUP($D:$D,基础资料!$A:C,3,0)","v":"蓝卡-海洋之歌1BD+1DVD"},{"$f":"VLOOKUP($D:$D,基础资料!$A:D,4,0)","v":"2"},{"$f":"VLOOKUP($D:$D,基础资料!$A:E,5,0)","v":"套"},{"$f":"VLOOKUP($D:$D,基础资料!$A:F,6,0)","v":"蓝光卡通"},null,null,85,{"$f":"SUMIF($D:$D,D43,$L:$L)+SUMIF($D:$D,D43,$J:$J)-SUMIF($D:$D,D43,$K:$K)","v":85},{"$f":"VLOOKUP(D:D,结存!A:J,10,0)","v":85},{"$f":"M43 - N43","v":0}]
[null,null,null,628,{"$f":"VLOOKUP($D:$D,基础资料!$A:B,2,0)","v":"07030004"},{"$f":"VLOOKUP($D:$D,基础资料!$A:C,3,0)","v":"蓝卡-怪物之子 1BD+1DVD"},{"$f":"VLOOKUP($D:$D,基础资料!$A:D,4,0)","v":"2"},{"$f":"VLOOKUP($D:$D,基础资料!$A:E,5,0)","v":"套"},{"$f":"VLOOKUP($D:$D,基础资料!$A:F,6,0)","v":"蓝光卡通"},null,null,98,{"$f":"SUMIF($D:$D,D44,$L:$L)+SUMIF($D:$D,D44,$J:$J)-SUMIF($D:$D,D44,$K:$K)","v":98},{"$f":"VLOOKUP(D:D,结存!A:J,10,0)","v":98},{"$f":"M44 - N44","v":0}]
[null,null,null,630,{"$f":"VLOOKUP($D:$D,基础资料!$A:B,2,0)","v":"07030006"},{"$f":"VLOOKUP($D:$D,基础资料!$A:C,3,0)","v":"蓝卡-非凡的世界  1BD+1DVD"},{"$f":"VLOOKUP($D:$D,基础资料!$A:D,4,0)","v":"2"},{"$f":"VLOOKUP($D:$D,基础资料!$A:E,5,0)","v":"套"},{"$f":"VLOOKUP($D:$D,基础资料!$A:F,6,0)","v":"蓝光卡通"},null,null,86,{"$f":"SUMIF($D:$D,D45,$L:$L)+SUMIF($D:$D,D45,$J:$J)-SUMIF($D:$D,D45,$K:$K)","v":86},{"$f":"VLOOKUP(D:D,结存!A:J,10,0)","v":86},{"$f":"M45 - N45","v":0}]
[null,null,null,632,{"$f":"VLOOKUP($D:$D,基础资料!$A:B,2,0)","v":"07030008"},{"$f":"VLOOKUP($D:$D,基础资料!$A:C,3,0)","v":"蓝卡-夏日大作战  1BD+2DVD"},{"$f":"VLOOKUP($D:$D,基础资料!$A:D,4,0)","v":"3"},{"$f":"VLOOKUP($D:$D,基础资料!$A:E,5,0)","v":"套"},{"$f":"VLOOKUP($D:$D,基础资料!$A:F,6,0)","v":"蓝光卡通"},null,null,88,{"$f":"SUMIF($D:$D,D46,$L:$L)+SUMIF($D:$D,D46,$J:$J)-SUMIF($D:$D,D46,$K:$K)","v":88},{"$f":"VLOOKUP(D:D,结存!A:J,10,0)","v":88},{"$f":"M46 - N46","v":0}]
[null,null,null,633,{"$f":"VLOOKUP($D:$D,基础资料!$A:B,2,0)","v":"07030009"},{"$f":"VLOOKUP($D:$D,基础资料!$A:C,3,0)","v":"蓝卡-星际牛仔  4BD"},{"$f":"VLOOKUP($D:$D,基础资料!$A:D,4,0)","v":"4"},{"$f":"VLOOKUP($D:$D,基础资料!$A:E,5,0)","v":"套"},{"$f":"VLOOKUP($D:$D,基础资料!$A:F,6,0)","v":"蓝光卡通"},null,null,19,{"$f":"SUMIF($D:$D,D47,$L:$L)+SUMIF($D:$D,D47,$J:$J)-SUMIF($D:$D,D47,$K:$K)","v":9},{"$f":"VLOOKUP(D:D,结存!A:J,10,0)","v":9},{"$f":"M47 - N47","v":0}]
[null,null,null,634,{"$f":"VLOOKUP($D:$D,基础资料!$A:B,2,0)","v":"07030010"},{"$f":"VLOOKUP($D:$D,基础资料!$A:C,3,0)","v":"蓝卡-言叶之庭 1BD"},{"$f":"VLOOKUP($D:$D,基础资料!$A:D,4,0)","v":"1"},{"$f":"VLOOKUP($D:$D,基础资料!$A:E,5,0)","v":"套"},{"$f":"VLOOKUP($D:$D,基础资料!$A:F,6,0)","v":"蓝光卡通"},null,null,78,{"$f":"SUMIF($D:$D,D48,$L:$L)+SUMIF($D:$D,D48,$J:$J)-SUMIF($D:$D,D48,$K:$K)","v":78},{"$f":"VLOOKUP(D:D,结存!A:J,10,0)","v":78},{"$f":"M48 - N48","v":0}]
[null,null,null,636,{"$f":"VLOOKUP($D:$D,基础资料!$A:B,2,0)","v":"0704000001"},{"$f":"VLOOKUP($D:$D,基础资料!$A:C,3,0)","v":"S-内识心理学"},{"$f":"VLOOKUP($D:$D,基础资料!$A:D,4,0)","v":"\\"},{"$f":"VLOOKUP($D:$D,基础资料!$A:E,5,0)","v":"本"},{"$f":"VLOOKUP($D:$D,基础资料!$A:F,6,0)","v":"书本"},null,null,979,{"$f":"SUMIF($D:$D,D49,$L:$L)+SUMIF($D:$D,D49,$J:$J)-SUMIF($D:$D,D49,$K:$K)","v":656},{"$f":"VLOOKUP(D:D,结存!A:J,10,0)","v":656},{"$f":"M49 - N49","v":0}]
[null,null,null,637,{"$f":"VLOOKUP($D:$D,基础资料!$A:B,2,0)","v":"0704000002"},{"$f":"VLOOKUP($D:$D,基础资料!$A:C,3,0)","v":"S-项目评价"},{"$f":"VLOOKUP($D:$D,基础资料!$A:D,4,0)","v":"\\"},{"$f":"VLOOKUP($D:$D,基础资料!$A:E,5,0)","v":"本"},{"$f":"VLOOKUP($D:$D,基础资料!$A:F,6,0)","v":"书本"},null,null,45,{"$f":"SUMIF($D:$D,D50,$L:$L)+SUMIF($D:$D,D50,$J:$J)-SUMIF($D:$D,D50,$K:$K)","v":1877},{"$f":"VLOOKUP(D:D,结存!A:J,10,0)","v":1877},{"$f":"M50 - N50","v":0}]
[null,null,null,638,{"$f":"VLOOKUP($D:$D,基础资料!$A:B,2,0)","v":"0704000003"},{"$f":"VLOOKUP($D:$D,基础资料!$A:C,3,0)","v":"S-人格理论"},{"$f":"VLOOKUP($D:$D,基础资料!$A:D,4,0)","v":"\\"},{"$f":"VLOOKUP($D:$D,基础资料!$A:E,5,0)","v":"本"},{"$f":"VLOOKUP($D:$D,基础资料!$A:F,6,0)","v":"书本"},null,null,586,{"$f":"SUMIF($D:$D,D51,$L:$L)+SUMIF($D:$D,D51,$J:$J)-SUMIF($D:$D,D51,$K:$K)","v":523},{"$f":"VLOOKUP(D:D,结存!A:J,10,0)","v":523},{"$f":"M51 - N51","v":0}]
[null,null,null,639,{"$f":"VLOOKUP($D:$D,基础资料!$A:B,2,0)","v":"0704000004"},{"$f":"VLOOKUP($D:$D,基础资料!$A:C,3,0)","v":"S-电器查询"},{"$f":"VLOOKUP($D:$D,基础资料!$A:D,4,0)","v":"\\"},{"$f":"VLOOKUP($D:$D,基础资料!$A:E,5,0)","v":"本"},{"$f":"VLOOKUP($D:$D,基础资料!$A:F,6,0)","v":"书本"},null,null,258,{"$f":"SUMIF($D:$D,D52,$L:$L)+SUMIF($D:$D,D52,$J:$J)-SUMIF($D:$D,D52,$K:$K)","v":223},{"$f":"VLOOKUP(D:D,结存!A:J,10,0)","v":223},{"$f":"M52 - N52","v":0}]
[null,null,null,640,{"$f":"VLOOKUP($D:$D,基础资料!$A:B,2,0)","v":"0704000035"},{"$f":"VLOOKUP($D:$D,基础资料!$A:C,3,0)","v":"S-商业：一个不断变化的世界"},{"$f":"VLOOKUP($D:$D,基础资料!$A:D,4,0)","v":"\\"},{"$f":"VLOOKUP($D:$D,基础资料!$A:E,5,0)","v":"本"},{"$f":"VLOOKUP($D:$D,基础资料!$A:F,6,0)","v":"书本"},null,null,527,{"$f":"SUMIF($D:$D,D53,$L:$L)+SUMIF($D:$D,D53,$J:$J)-SUMIF($D:$D,D53,$K:$K)","v":474},{"$f":"VLOOKUP(D:D,结存!A:J,10,0)","v":474},{"$f":"M53 - N53","v":0}]
[null,null,null,641,{"$f":"VLOOKUP($D:$D,基础资料!$A:B,2,0)","v":"0704000036"},{"$f":"VLOOKUP($D:$D,基础资料!$A:C,3,0)","v":"S-我们的人民"},{"$f":"VLOOKUP($D:$D,基础资料!$A:D,4,0)","v":"\\"},{"$f":"VLOOKUP($D:$D,基础资料!$A:E,5,0)","v":"本"},{"$f":"VLOOKUP($D:$D,基础资料!$A:F,6,0)","v":"书本"},null,null,2745,{"$f":"SUMIF($D:$D,D54,$L:$L)+SUMIF($D:$D,D54,$J:$J)-SUMIF($D:$D,D54,$K:$K)","v":2685},{"$f":"VLOOKUP(D:D,结存!A:J,10,0)","v":2685},{"$f":"M54 - N54","v":0}]
[null,null,null,642,{"$f":"VLOOKUP($D:$D,基础资料!$A:B,2,0)","v":"07040001"},{"$f":"VLOOKUP($D:$D,基础资料!$A:C,3,0)","v":"S-恐怖故事（3本一套）"},{"$f":"VLOOKUP($D:$D,基础资料!$A:D,4,0)","v":"\\"},{"$f":"VLOOKUP($D:$D,基础资料!$A:E,5,0)","v":"套"},{"$f":"VLOOKUP($D:$D,基础资料!$A:F,6,0)","v":"书本"},null,null,91,{"$f":"SUMIF($D:$D,D55,$L:$L)+SUMIF($D:$D,D55,$J:$J)-SUMIF($D:$D,D55,$K:$K)","v":35},{"$f":"VLOOKUP(D:D,结存!A:J,10,0)","v":35},{"$f":"M55 - N55","v":0}]
[null,null,null,643,{"$f":"VLOOKUP($D:$D,基础资料!$A:B,2,0)","v":"07040002"},{"$f":"VLOOKUP($D:$D,基础资料!$A:C,3,0)","v":"S-定量技术分析"},{"$f":"VLOOKUP($D:$D,基础资料!$A:D,4,0)","v":"\\"},{"$f":"VLOOKUP($D:$D,基础资料!$A:E,5,0)","v":"本"},{"$f":"VLOOKUP($D:$D,基础资料!$A:F,6,0)","v":"书本"},null,null,570,{"$f":"SUMIF($D:$D,D56,$L:$L)+SUMIF($D:$D,D56,$J:$J)-SUMIF($D:$D,D56,$K:$K)","v":570},{"$f":"VLOOKUP(D:D,结存!A:J,10,0)","v":570},{"$f":"M56 - N56","v":0}]
[null,null,null,644,{"$f":"VLOOKUP($D:$D,基础资料!$A:B,2,0)","v":"0704000293"},{"$f":"VLOOKUP($D:$D,基础资料!$A:C,3,0)","v":"S-环境经济学"},{"$f":"VLOOKUP($D:$D,基础资料!$A:D,4,0)","v":"\\"},{"$f":"VLOOKUP($D:$D,基础资料!$A:E,5,0)","v":"本"},{"$f":"VLOOKUP($D:$D,基础资料!$A:F,6,0)","v":"书本"},null,null,555,{"$f":"SUMIF($D:$D,D57,$L:$L)+SUMIF($D:$D,D57,$J:$J)-SUMIF($D:$D,D57,$K:$K)","v":419},{"$f":"VLOOKUP(D:D,结存!A:J,10,0)","v":419},{"$f":"M57 - N57","v":0}]
[null,null,null,645,{"$f":"VLOOKUP($D:$D,基础资料!$A:B,2,0)","v":"07040003"},{"$f":"VLOOKUP($D:$D,基础资料!$A:C,3,0)","v":"S-公共演讲的艺术"},{"$f":"VLOOKUP($D:$D,基础资料!$A:D,4,0)","v":"\\"},{"$f":"VLOOKUP($D:$D,基础资料!$A:E,5,0)","v":"本"},{"$f":"VLOOKUP($D:$D,基础资料!$A:F,6,0)","v":"书本"},null,null,1461,{"$f":"SUMIF($D:$D,D58,$L:$L)+SUMIF($D:$D,D58,$J:$J)-SUMIF($D:$D,D58,$K:$K)","v":1403},{"$f":"VLOOKUP(D:D,结存!A:J,10,0)","v":1403},{"$f":"M58 - N58","v":0}]
[null,null,null,646,{"$f":"VLOOKUP($D:$D,基础资料!$A:B,2,0)","v":"07040004"},{"$f":"VLOOKUP($D:$D,基础资料!$A:C,3,0)","v":"S-媒体伦理"},{"$f":"VLOOKUP($D:$D,基础资料!$A:D,4,0)","v":"\\"},{"$f":"VLOOKUP($D:$D,基础资料!$A:E,5,0)","v":"本"},{"$f":"VLOOKUP($D:$D,基础资料!$A:F,6,0)","v":"书本"},null,null,619,{"$f":"SUMIF($D:$D,D59,$L:$L)+SUMIF($D:$D,D59,$J:$J)-SUMIF($D:$D,D59,$K:$K)","v":619},{"$f":"VLOOKUP(D:D,结存!A:J,10,0)","v":619},{"$f":"M59 - N59","v":0}]
[null,null,null,647,{"$f":"VLOOKUP($D:$D,基础资料!$A:B,2,0)","v":"07040005"},{"$f":"VLOOKUP($D:$D,基础资料!$A:C,3,0)","v":"S-有效的小组讨论"},{"$f":"VLOOKUP($D:$D,基础资料!$A:D,4,0)","v":"\\"},{"$f":"VLOOKUP($D:$D,基础资料!$A:E,5,0)","v":"本"},{"$f":"VLOOKUP($D:$D,基础资料!$A:F,6,0)","v":"书本"},null,null,382,{"$f":"SUMIF($D:$D,D60,$L:$L)+SUMIF($D:$D,D60,$J:$J)-SUMIF($D:$D,D60,$K:$K)","v":382},{"$f":"VLOOKUP(D:D,结存!A:J,10,0)","v":382},{"$f":"M60 - N60","v":0}]
[null,null,null,648,{"$f":"VLOOKUP($D:$D,基础资料!$A:B,2,0)","v":"07040006"},{"$f":"VLOOKUP($D:$D,基础资料!$A:C,3,0)","v":"S-大众传媒法"},{"$f":"VLOOKUP($D:$D,基础资料!$A:D,4,0)","v":"\\"},{"$f":"VLOOKUP($D:$D,基础资料!$A:E,5,0)","v":"本"},{"$f":"VLOOKUP($D:$D,基础资料!$A:F,6,0)","v":"书本"},null,null,94,{"$f":"SUMIF($D:$D,D61,$L:$L)+SUMIF($D:$D,D61,$J:$J)-SUMIF($D:$D,D61,$K:$K)","v":19},{"$f":"VLOOKUP(D:D,结存!A:J,10,0)","v":19},{"$f":"M61 - N61","v":0}]
[null,null,null,649,{"$f":"VLOOKUP($D:$D,基础资料!$A:B,2,0)","v":"07040007"},{"$f":"VLOOKUP($D:$D,基础资料!$A:C,3,0)","v":"S-行为研究方法"},{"$f":"VLOOKUP($D:$D,基础资料!$A:D,4,0)","v":"\\"},{"$f":"VLOOKUP($D:$D,基础资料!$A:E,5,0)","v":"本"},{"$f":"VLOOKUP($D:$D,基础资料!$A:F,6,0)","v":"书本"},null,null,4620,{"$f":"SUMIF($D:$D,D62,$L:$L)+SUMIF($D:$D,D62,$J:$J)-SUMIF($D:$D,D62,$K:$K)","v":4577},{"$f":"VLOOKUP(D:D,结存!A:J,10,0)","v":4577},{"$f":"M62 - N62","v":0}]
[null,null,null,650,{"$f":"VLOOKUP($D:$D,基础资料!$A:B,2,0)","v":"07040008"},{"$f":"VLOOKUP($D:$D,基础资料!$A:C,3,0)","v":"S-谈判精要"},{"$f":"VLOOKUP($D:$D,基础资料!$A:D,4,0)","v":"\\"},{"$f":"VLOOKUP($D:$D,基础资料!$A:E,5,0)","v":"本"},{"$f":"VLOOKUP($D:$D,基础资料!$A:F,6,0)","v":"书本"},null,null,678,{"$f":"SUMIF($D:$D,D63,$L:$L)+SUMIF($D:$D,D63,$J:$J)-SUMIF($D:$D,D63,$K:$K)","v":538},{"$f":"VLOOKUP(D:D,结存!A:J,10,0)","v":538},{"$f":"M63 - N63","v":0}]
[null,null,null,651,{"$f":"VLOOKUP($D:$D,基础资料!$A:B,2,0)","v":"07040009"},{"$f":"VLOOKUP($D:$D,基础资料!$A:C,3,0)","v":"S-合作、协商和团队合作"},{"$f":"VLOOKUP($D:$D,基础资料!$A:D,4,0)","v":"\\"},{"$f":"VLOOKUP($D:$D,基础资料!$A:E,5,0)","v":"本"},{"$f":"VLOOKUP($D:$D,基础资料!$A:F,6,0)","v":"书本"},null,null,314,{"$f":"SUMIF($D:$D,D64,$L:$L)+SUMIF($D:$D,D64,$J:$J)-SUMIF($D:$D,D64,$K:$K)","v":311},{"$f":"VLOOKUP(D:D,结存!A:J,10,0)","v":311},{"$f":"M64 - N64","v":0}]
[null,null,null,652,{"$f":"VLOOKUP($D:$D,基础资料!$A:B,2,0)","v":"07040010"},{"$f":"VLOOKUP($D:$D,基础资料!$A:C,3,0)","v":"S-管理技能养成"},{"$f":"VLOOKUP($D:$D,基础资料!$A:D,4,0)","v":"\\"},{"$f":"VLOOKUP($D:$D,基础资料!$A:E,5,0)","v":"本"},{"$f":"VLOOKUP($D:$D,基础资料!$A:F,6,0)","v":"书本"},null,null,424,{"$f":"SUMIF($D:$D,D65,$L:$L)+SUMIF($D:$D,D65,$J:$J)-SUMIF($D:$D,D65,$K:$K)","v":292},{"$f":"VLOOKUP(D:D,结存!A:J,10,0)","v":292},{"$f":"M65 - N65","v":0}]
[null,null,null,653,{"$f":"VLOOKUP($D:$D,基础资料!$A:B,2,0)","v":"07040011"},{"$f":"VLOOKUP($D:$D,基础资料!$A:C,3,0)","v":"S-实现改变"},{"$f":"VLOOKUP($D:$D,基础资料!$A:D,4,0)","v":"\\"},{"$f":"VLOOKUP($D:$D,基础资料!$A:E,5,0)","v":"本"},{"$f":"VLOOKUP($D:$D,基础资料!$A:F,6,0)","v":"书本"},null,null,985,{"$f":"SUMIF($D:$D,D66,$L:$L)+SUMIF($D:$D,D66,$J:$J)-SUMIF($D:$D,D66,$K:$K)","v":985},{"$f":"VLOOKUP(D:D,结存!A:J,10,0)","v":985},{"$f":"M66 - N66","v":0}]
[null,null,null,654,{"$f":"VLOOKUP($D:$D,基础资料!$A:B,2,0)","v":"07040012"},{"$f":"VLOOKUP($D:$D,基础资料!$A:C,3,0)","v":"S-实践研究"},{"$f":"VLOOKUP($D:$D,基础资料!$A:D,4,0)","v":"\\"},{"$f":"VLOOKUP($D:$D,基础资料!$A:E,5,0)","v":"本"},{"$f":"VLOOKUP($D:$D,基础资料!$A:F,6,0)","v":"书本"},null,null,2002,{"$f":"SUMIF($D:$D,D67,$L:$L)+SUMIF($D:$D,D67,$J:$J)-SUMIF($D:$D,D67,$K:$K)","v":1966},{"$f":"VLOOKUP(D:D,结存!A:J,10,0)","v":1966},{"$f":"M67 - N67","v":0}]
[null,null,null,655,{"$f":"VLOOKUP($D:$D,基础资料!$A:B,2,0)","v":"07040013"},{"$f":"VLOOKUP($D:$D,基础资料!$A:C,3,0)","v":"S-校园法律"},{"$f":"VLOOKUP($D:$D,基础资料!$A:D,4,0)","v":"\\"},{"$f":"VLOOKUP($D:$D,基础资料!$A:E,5,0)","v":"本"},{"$f":"VLOOKUP($D:$D,基础资料!$A:F,6,0)","v":"书本"},null,null,768,{"$f":"SUMIF($D:$D,D68,$L:$L)+SUMIF($D:$D,D68,$J:$J)-SUMIF($D:$D,D68,$K:$K)","v":698},{"$f":"VLOOKUP(D:D,结存!A:J,10,0)","v":698},{"$f":"M68 - N68","v":0}]
[null,null,null,656,{"$f":"VLOOKUP($D:$D,基础资料!$A:B,2,0)","v":"07040014"},{"$f":"VLOOKUP($D:$D,基础资料!$A:C,3,0)","v":"S-伦理护理"},{"$f":"VLOOKUP($D:$D,基础资料!$A:D,4,0)","v":"\\"},{"$f":"VLOOKUP($D:$D,基础资料!$A:E,5,0)","v":"本"},{"$f":"VLOOKUP($D:$D,基础资料!$A:F,6,0)","v":"书本"},null,null,966,{"$f":"SUMIF($D:$D,D69,$L:$L)+SUMIF($D:$D,D69,$J:$J)-SUMIF($D:$D,D69,$K:$K)","v":956},{"$f":"VLOOKUP(D:D,结存!A:J,10,0)","v":956},{"$f":"M69 - N69","v":0}]
[null,null,null,657,{"$f":"VLOOKUP($D:$D,基础资料!$A:B,2,0)","v":"07040015"},{"$f":"VLOOKUP($D:$D,基础资料!$A:C,3,0)","v":"S-心理学"},{"$f":"VLOOKUP($D:$D,基础资料!$A:D,4,0)","v":"\\"},{"$f":"VLOOKUP($D:$D,基础资料!$A:E,5,0)","v":"本"},{"$f":"VLOOKUP($D:$D,基础资料!$A:F,6,0)","v":"书本"},null,null,575,{"$f":"SUMIF($D:$D,D70,$L:$L)+SUMIF($D:$D,D70,$J:$J)-SUMIF($D:$D,D70,$K:$K)","v":575},{"$f":"VLOOKUP(D:D,结存!A:J,10,0)","v":575},{"$f":"M70 - N70","v":0}]
[null,null,null,658,{"$f":"VLOOKUP($D:$D,基础资料!$A:B,2,0)","v":"07040016"},{"$f":"VLOOKUP($D:$D,基础资料!$A:C,3,0)","v":"S-四十项心理学的研究 821"},{"$f":"VLOOKUP($D:$D,基础资料!$A:D,4,0)","v":"\\"},{"$f":"VLOOKUP($D:$D,基础资料!$A:E,5,0)","v":"本"},{"$f":"VLOOKUP($D:$D,基础资料!$A:F,6,0)","v":"书本"},null,null,251,{"$f":"SUMIF($D:$D,D71,$L:$L)+SUMIF($D:$D,D71,$J:$J)-SUMIF($D:$D,D71,$K:$K)","v":1},{"$f":"VLOOKUP(D:D,结存!A:J,10,0)","v":1},{"$f":"M71 - N71","v":0}]
[null,null,null,659,{"$f":"VLOOKUP($D:$D,基础资料!$A:B,2,0)","v":"07040017"},{"$f":"VLOOKUP($D:$D,基础资料!$A:C,3,0)","v":"S-实习手册"},{"$f":"VLOOKUP($D:$D,基础资料!$A:D,4,0)","v":"\\"},{"$f":"VLOOKUP($D:$D,基础资料!$A:E,5,0)","v":"本"},{"$f":"VLOOKUP($D:$D,基础资料!$A:F,6,0)","v":"书本"},null,null,934,{"$f":"SUMIF($D:$D,D72,$L:$L)+SUMIF($D:$D,D72,$J:$J)-SUMIF($D:$D,D72,$K:$K)","v":934},{"$f":"VLOOKUP(D:D,结存!A:J,10,0)","v":934},{"$f":"M72 - N72","v":0}]
[null,null,null,660,{"$f":"VLOOKUP($D:$D,基础资料!$A:B,2,0)","v":"07040018"},{"$f":"VLOOKUP($D:$D,基础资料!$A:C,3,0)","v":"S-明了和优雅风格的教训"},{"$f":"VLOOKUP($D:$D,基础资料!$A:D,4,0)","v":"\\"},{"$f":"VLOOKUP($D:$D,基础资料!$A:E,5,0)","v":"本"},{"$f":"VLOOKUP($D:$D,基础资料!$A:F,6,0)","v":"书本"},null,null,454,{"$f":"SUMIF($D:$D,D73,$L:$L)+SUMIF($D:$D,D73,$J:$J)-SUMIF($D:$D,D73,$K:$K)","v":454},{"$f":"VLOOKUP(D:D,结存!A:J,10,0)","v":454},{"$f":"M73 - N73","v":0}]
[null,null,null,661,{"$f":"VLOOKUP($D:$D,基础资料!$A:B,2,0)","v":"07040019"},{"$f":"VLOOKUP($D:$D,基础资料!$A:C,3,0)","v":"S-美国药疗保健"},{"$f":"VLOOKUP($D:$D,基础资料!$A:D,4,0)","v":"\\"},{"$f":"VLOOKUP($D:$D,基础资料!$A:E,5,0)","v":"本"},{"$f":"VLOOKUP($D:$D,基础资料!$A:F,6,0)","v":"书本"},null,null,1029,{"$f":"SUMIF($D:$D,D74,$L:$L)+SUMIF($D:$D,D74,$J:$J)-SUMIF($D:$D,D74,$K:$K)","v":975},{"$f":"VLOOKUP(D:D,结存!A:J,10,0)","v":975},{"$f":"M74 - N74","v":0}]
[null,null,null,662,{"$f":"VLOOKUP($D:$D,基础资料!$A:B,2,0)","v":"07040020"},{"$f":"VLOOKUP($D:$D,基础资料!$A:C,3,0)","v":"S-硕士考试指南"},{"$f":"VLOOKUP($D:$D,基础资料!$A:D,4,0)","v":"\\"},{"$f":"VLOOKUP($D:$D,基础资料!$A:E,5,0)","v":"本"},{"$f":"VLOOKUP($D:$D,基础资料!$A:F,6,0)","v":"书本"},null,null,2144,{"$f":"SUMIF($D:$D,D75,$L:$L)+SUMIF($D:$D,D75,$J:$J)-SUMIF($D:$D,D75,$K:$K)","v":2104},{"$f":"VLOOKUP(D:D,结存!A:J,10,0)","v":2104},{"$f":"M75 - N75","v":0}]
[null,null,null,663,{"$f":"VLOOKUP($D:$D,基础资料!$A:B,2,0)","v":"07040021"},{"$f":"VLOOKUP($D:$D,基础资料!$A:C,3,0)","v":"S-面试技巧"},{"$f":"VLOOKUP($D:$D,基础资料!$A:D,4,0)","v":"\\"},{"$f":"VLOOKUP($D:$D,基础资料!$A:E,5,0)","v":"本"},{"$f":"VLOOKUP($D:$D,基础资料!$A:F,6,0)","v":"书本"},null,null,615,{"$f":"SUMIF($D:$D,D76,$L:$L)+SUMIF($D:$D,D76,$J:$J)-SUMIF($D:$D,D76,$K:$K)","v":595},{"$f":"VLOOKUP(D:D,结存!A:J,10,0)","v":595},{"$f":"M76 - N76","v":0}]
[null,null,null,664,{"$f":"VLOOKUP($D:$D,基础资料!$A:B,2,0)","v":"07040022"},{"$f":"VLOOKUP($D:$D,基础资料!$A:C,3,0)","v":"S-麦克的学习技巧"},{"$f":"VLOOKUP($D:$D,基础资料!$A:D,4,0)","v":"\\"},{"$f":"VLOOKUP($D:$D,基础资料!$A:E,5,0)","v":"本"},{"$f":"VLOOKUP($D:$D,基础资料!$A:F,6,0)","v":"书本"},null,null,594,{"$f":"SUMIF($D:$D,D77,$L:$L)+SUMIF($D:$D,D77,$J:$J)-SUMIF($D:$D,D77,$K:$K)","v":594},{"$f":"VLOOKUP(D:D,结存!A:J,10,0)","v":594},{"$f":"M77 - N77","v":0}]
[null,null,null,665,{"$f":"VLOOKUP($D:$D,基础资料!$A:B,2,0)","v":"07040023"},{"$f":"VLOOKUP($D:$D,基础资料!$A:C,3,0)","v":"S-医生的护理实践"},{"$f":"VLOOKUP($D:$D,基础资料!$A:D,4,0)","v":"\\"},{"$f":"VLOOKUP($D:$D,基础资料!$A:E,5,0)","v":"本"},{"$f":"VLOOKUP($D:$D,基础资料!$A:F,6,0)","v":"书本"},null,null,1327,{"$f":"SUMIF($D:$D,D78,$L:$L)+SUMIF($D:$D,D78,$J:$J)-SUMIF($D:$D,D78,$K:$K)","v":1327},{"$f":"VLOOKUP(D:D,结存!A:J,10,0)","v":1327},{"$f":"M78 - N78","v":0}]
[null,null,null,666,{"$f":"VLOOKUP($D:$D,基础资料!$A:B,2,0)","v":"07040024"},{"$f":"VLOOKUP($D:$D,基础资料!$A:C,3,0)","v":"S-社会精神"},{"$f":"VLOOKUP($D:$D,基础资料!$A:D,4,0)","v":"\\"},{"$f":"VLOOKUP($D:$D,基础资料!$A:E,5,0)","v":"本"},{"$f":"VLOOKUP($D:$D,基础资料!$A:F,6,0)","v":"书本"},null,null,606,{"$f":"SUMIF($D:$D,D79,$L:$L)+SUMIF($D:$D,D79,$J:$J)-SUMIF($D:$D,D79,$K:$K)","v":606},{"$f":"VLOOKUP(D:D,结存!A:J,10,0)","v":606},{"$f":"M79 - N79","v":0}]
[null,null,null,667,{"$f":"VLOOKUP($D:$D,基础资料!$A:B,2,0)","v":"07040025"},{"$f":"VLOOKUP($D:$D,基础资料!$A:C,3,0)","v":"S-临床评估工作簿"},{"$f":"VLOOKUP($D:$D,基础资料!$A:D,4,0)","v":"\\"},{"$f":"VLOOKUP($D:$D,基础资料!$A:E,5,0)","v":"本"},{"$f":"VLOOKUP($D:$D,基础资料!$A:F,6,0)","v":"书本"},null,null,2358,{"$f":"SUMIF($D:$D,D80,$L:$L)+SUMIF($D:$D,D80,$J:$J)-SUMIF($D:$D,D80,$K:$K)","v":2338},{"$f":"VLOOKUP(D:D,结存!A:J,10,0)","v":2338},{"$f":"M80 - N80","v":0}]
[null,null,null,668,{"$f":"VLOOKUP($D:$D,基础资料!$A:B,2,0)","v":"07040026"},{"$f":"VLOOKUP($D:$D,基础资料!$A:C,3,0)","v":"S-团体咨询"},{"$f":"VLOOKUP($D:$D,基础资料!$A:D,4,0)","v":"\\"},{"$f":"VLOOKUP($D:$D,基础资料!$A:E,5,0)","v":"本"},{"$f":"VLOOKUP($D:$D,基础资料!$A:F,6,0)","v":"书本"},null,null,1522,{"$f":"SUMIF($D:$D,D81,$L:$L)+SUMIF($D:$D,D81,$J:$J)-SUMIF($D:$D,D81,$K:$K)","v":1473},{"$f":"VLOOKUP(D:D,结存!A:J,10,0)","v":1473},{"$f":"M81 - N81","v":0}]
[null,null,null,669,{"$f":"VLOOKUP($D:$D,基础资料!$A:B,2,0)","v":"07040027"},{"$f":"VLOOKUP($D:$D,基础资料!$A:C,3,0)","v":"S-小屁孩日记（9本一套）"},{"$f":"VLOOKUP($D:$D,基础资料!$A:D,4,0)","v":"\\"},{"$f":"VLOOKUP($D:$D,基础资料!$A:E,5,0)","v":"套"},{"$f":"VLOOKUP($D:$D,基础资料!$A:F,6,0)","v":"书本"},null,null,963,{"$f":"SUMIF($D:$D,D82,$L:$L)+SUMIF($D:$D,D82,$J:$J)-SUMIF($D:$D,D82,$K:$K)","v":958},{"$f":"VLOOKUP(D:D,结存!A:J,10,0)","v":958},{"$f":"M82 - N82","v":0}]
[null,null,null,677,{"$f":"VLOOKUP($D:$D,基础资料!$A:B,2,0)","v":"07040027-1"},{"$f":"VLOOKUP($D:$D,基础资料!$A:C,3,0)","v":"S-小屁孩日记（1/9本一套）"},{"$f":"VLOOKUP($D:$D,基础资料!$A:D,4,0)","v":"\\"},{"$f":"VLOOKUP($D:$D,基础资料!$A:E,5,0)","v":"本"},{"$f":"VLOOKUP($D:$D,基础资料!$A:F,6,0)","v":"书本"},null,null,8,{"$f":"SUMIF($D:$D,D83,$L:$L)+SUMIF($D:$D,D83,$J:$J)-SUMIF($D:$D,D83,$K:$K)","v":8},{"$f":"VLOOKUP(D:D,结存!A:J,10,0)","v":8},{"$f":"M83 - N83","v":0}]
[null,null,null,678,{"$f":"VLOOKUP($D:$D,基础资料!$A:B,2,0)","v":"07040027-2"},{"$f":"VLOOKUP($D:$D,基础资料!$A:C,3,0)","v":"S-小屁孩日记（2/9本一套）"},{"$f":"VLOOKUP($D:$D,基础资料!$A:D,4,0)","v":"\\"},{"$f":"VLOOKUP($D:$D,基础资料!$A:E,5,0)","v":"本"},{"$f":"VLOOKUP($D:$D,基础资料!$A:F,6,0)","v":"书本"},null,null,1,{"$f":"SUMIF($D:$D,D84,$L:$L)+SUMIF($D:$D,D84,$J:$J)-SUMIF($D:$D,D84,$K:$K)","v":1},{"$f":"VLOOKUP(D:D,结存!A:J,10,0)","v":1},{"$f":"M84 - N84","v":0}]
[null,null,null,679,{"$f":"VLOOKUP($D:$D,基础资料!$A:B,2,0)","v":"07040027-3"},{"$f":"VLOOKUP($D:$D,基础资料!$A:C,3,0)","v":"S-小屁孩日记（3/9本一套）"},{"$f":"VLOOKUP($D:$D,基础资料!$A:D,4,0)","v":"\\"},{"$f":"VLOOKUP($D:$D,基础资料!$A:E,5,0)","v":"本"},{"$f":"VLOOKUP($D:$D,基础资料!$A:F,6,0)","v":"书本"},null,null,11,{"$f":"SUMIF($D:$D,D85,$L:$L)+SUMIF($D:$D,D85,$J:$J)-SUMIF($D:$D,D85,$K:$K)","v":11},{"$f":"VLOOKUP(D:D,结存!A:J,10,0)","v":11},{"$f":"M85 - N85","v":0}]
[null,null,null,680,{"$f":"VLOOKUP($D:$D,基础资料!$A:B,2,0)","v":"07040027-4"},{"$f":"VLOOKUP($D:$D,基础资料!$A:C,3,0)","v":"S-小屁孩日记（4/9本一套）"},{"$f":"VLOOKUP($D:$D,基础资料!$A:D,4,0)","v":"\\"},{"$f":"VLOOKUP($D:$D,基础资料!$A:E,5,0)","v":"本"},{"$f":"VLOOKUP($D:$D,基础资料!$A:F,6,0)","v":"书本"},null,null,15,{"$f":"SUMIF($D:$D,D86,$L:$L)+SUMIF($D:$D,D86,$J:$J)-SUMIF($D:$D,D86,$K:$K)","v":15},{"$f":"VLOOKUP(D:D,结存!A:J,10,0)","v":15},{"$f":"M86 - N86","v":0}]
[null,null,null,681,{"$f":"VLOOKUP($D:$D,基础资料!$A:B,2,0)","v":"07040027-5"},{"$f":"VLOOKUP($D:$D,基础资料!$A:C,3,0)","v":"S-小屁孩日记（5/9本一套）"},{"$f":"VLOOKUP($D:$D,基础资料!$A:D,4,0)","v":"\\"},{"$f":"VLOOKUP($D:$D,基础资料!$A:E,5,0)","v":"本"},{"$f":"VLOOKUP($D:$D,基础资料!$A:F,6,0)","v":"书本"},null,null,30,{"$f":"SUMIF($D:$D,D87,$L:$L)+SUMIF($D:$D,D87,$J:$J)-SUMIF($D:$D,D87,$K:$K)","v":30},{"$f":"VLOOKUP(D:D,结存!A:J,10,0)","v":30},{"$f":"M87 - N87","v":0}]
[null,null,null,682,{"$f":"VLOOKUP($D:$D,基础资料!$A:B,2,0)","v":"07040027-6"},{"$f":"VLOOKUP($D:$D,基础资料!$A:C,3,0)","v":"S-小屁孩日记（6/9本一套）"},{"$f":"VLOOKUP($D:$D,基础资料!$A:D,4,0)","v":"\\"},{"$f":"VLOOKUP($D:$D,基础资料!$A:E,5,0)","v":"本"},{"$f":"VLOOKUP($D:$D,基础资料!$A:F,6,0)","v":"书本"},null,null,570,{"$f":"SUMIF($D:$D,D88,$L:$L)+SUMIF($D:$D,D88,$J:$J)-SUMIF($D:$D,D88,$K:$K)","v":570},{"$f":"VLOOKUP(D:D,结存!A:J,10,0)","v":570},{"$f":"M88 - N88","v":0}]
[null,null,null,683,{"$f":"VLOOKUP($D:$D,基础资料!$A:B,2,0)","v":"07040027-7"},{"$f":"VLOOKUP($D:$D,基础资料!$A:C,3,0)","v":"S-小屁孩日记（7/9本一套）"},{"$f":"VLOOKUP($D:$D,基础资料!$A:D,4,0)","v":"\\"},{"$f":"VLOOKUP($D:$D,基础资料!$A:E,5,0)","v":"本"},{"$f":"VLOOKUP($D:$D,基础资料!$A:F,6,0)","v":"书本"},null,null,517,{"$f":"SUMIF($D:$D,D89,$L:$L)+SUMIF($D:$D,D89,$J:$J)-SUMIF($D:$D,D89,$K:$K)","v":517},{"$f":"VLOOKUP(D:D,结存!A:J,10,0)","v":517},{"$f":"M89 - N89","v":0}]
[null,null,null,684,{"$f":"VLOOKUP($D:$D,基础资料!$A:B,2,0)","v":"07040027-8"},{"$f":"VLOOKUP($D:$D,基础资料!$A:C,3,0)","v":"S-小屁孩日记（8/9本一套）"},{"$f":"VLOOKUP($D:$D,基础资料!$A:D,4,0)","v":"\\"},{"$f":"VLOOKUP($D:$D,基础资料!$A:E,5,0)","v":"本"},{"$f":"VLOOKUP($D:$D,基础资料!$A:F,6,0)","v":"书本"},null,null,454,{"$f":"SUMIF($D:$D,D90,$L:$L)+SUMIF($D:$D,D90,$J:$J)-SUMIF($D:$D,D90,$K:$K)","v":454},{"$f":"VLOOKUP(D:D,结存!A:J,10,0)","v":454},{"$f":"M90 - N90","v":0}]
[null,null,null,685,{"$f":"VLOOKUP($D:$D,基础资料!$A:B,2,0)","v":"07040027-9"},{"$f":"VLOOKUP($D:$D,基础资料!$A:C,3,0)","v":"S-小屁孩日记（9/9本一套）"},{"$f":"VLOOKUP($D:$D,基础资料!$A:D,4,0)","v":"\\"},{"$f":"VLOOKUP($D:$D,基础资料!$A:E,5,0)","v":"本"},{"$f":"VLOOKUP($D:$D,基础资料!$A:F,6,0)","v":"书本"},null,null,508,{"$f":"SUMIF($D:$D,D91,$L:$L)+SUMIF($D:$D,D91,$J:$J)-SUMIF($D:$D,D91,$K:$K)","v":508},{"$f":"VLOOKUP(D:D,结存!A:J,10,0)","v":508},{"$f":"M91 - N91","v":0}]
[null,null,null,670,{"$f":"VLOOKUP($D:$D,基础资料!$A:B,2,0)","v":"07040028"},{"$f":"VLOOKUP($D:$D,基础资料!$A:C,3,0)","v":"S-上诉辩护"},{"$f":"VLOOKUP($D:$D,基础资料!$A:D,4,0)","v":"\\"},{"$f":"VLOOKUP($D:$D,基础资料!$A:E,5,0)","v":"本"},{"$f":"VLOOKUP($D:$D,基础资料!$A:F,6,0)","v":"书本"},null,null,703,{"$f":"SUMIF($D:$D,D92,$L:$L)+SUMIF($D:$D,D92,$J:$J)-SUMIF($D:$D,D92,$K:$K)","v":703},{"$f":"VLOOKUP(D:D,结存!A:J,10,0)","v":703},{"$f":"M92 - N92","v":0}]
[null,null,null,671,{"$f":"VLOOKUP($D:$D,基础资料!$A:B,2,0)","v":"07040029"},{"$f":"VLOOKUP($D:$D,基础资料!$A:C,3,0)","v":"S-法律研究"},{"$f":"VLOOKUP($D:$D,基础资料!$A:D,4,0)","v":"\\"},{"$f":"VLOOKUP($D:$D,基础资料!$A:E,5,0)","v":"本"},{"$f":"VLOOKUP($D:$D,基础资料!$A:F,6,0)","v":"书本"},null,null,807,{"$f":"SUMIF($D:$D,D93,$L:$L)+SUMIF($D:$D,D93,$J:$J)-SUMIF($D:$D,D93,$K:$K)","v":807},{"$f":"VLOOKUP(D:D,结存!A:J,10,0)","v":807},{"$f":"M93 - N93","v":0}]
[null,null,null,672,{"$f":"VLOOKUP($D:$D,基础资料!$A:B,2,0)","v":"07040030"},{"$f":"VLOOKUP($D:$D,基础资料!$A:C,3,0)","v":"S-法律写作和分析"},{"$f":"VLOOKUP($D:$D,基础资料!$A:D,4,0)","v":"\\"},{"$f":"VLOOKUP($D:$D,基础资料!$A:E,5,0)","v":"本"},{"$f":"VLOOKUP($D:$D,基础资料!$A:F,6,0)","v":"书本"},null,null,0,{"$f":"SUMIF($D:$D,D94,$L:$L)+SUMIF($D:$D,D94,$J:$J)-SUMIF($D:$D,D94,$K:$K)","v":712},{"$f":"VLOOKUP(D:D,结存!A:J,10,0)","v":712},{"$f":"M94 - N94","v":0}]
[null,null,null,673,{"$f":"VLOOKUP($D:$D,基础资料!$A:B,2,0)","v":"07040031"},{"$f":"VLOOKUP($D:$D,基础资料!$A:C,3,0)","v":"S-电子和计算机考试学习指南"},{"$f":"VLOOKUP($D:$D,基础资料!$A:D,4,0)","v":"\\"},{"$f":"VLOOKUP($D:$D,基础资料!$A:E,5,0)","v":"本"},{"$f":"VLOOKUP($D:$D,基础资料!$A:F,6,0)","v":"书本"},null,null,719,{"$f":"SUMIF($D:$D,D95,$L:$L)+SUMIF($D:$D,D95,$J:$J)-SUMIF($D:$D,D95,$K:$K)","v":719},{"$f":"VLOOKUP(D:D,结存!A:J,10,0)","v":719},{"$f":"M95 - N95","v":0}]
[null,null,null,674,{"$f":"VLOOKUP($D:$D,基础资料!$A:B,2,0)","v":"07040032"},{"$f":"VLOOKUP($D:$D,基础资料!$A:C,3,0)","v":"S-民事诉讼"},{"$f":"VLOOKUP($D:$D,基础资料!$A:D,4,0)","v":"\\"},{"$f":"VLOOKUP($D:$D,基础资料!$A:E,5,0)","v":"本"},{"$f":"VLOOKUP($D:$D,基础资料!$A:F,6,0)","v":"书本"},null,null,710,{"$f":"SUMIF($D:$D,D96,$L:$L)+SUMIF($D:$D,D96,$J:$J)-SUMIF($D:$D,D96,$K:$K)","v":707},{"$f":"VLOOKUP(D:D,结存!A:J,10,0)","v":707},{"$f":"M96 - N96","v":0}]
[null,null,null,675,{"$f":"VLOOKUP($D:$D,基础资料!$A:B,2,0)","v":"07040033"},{"$f":"VLOOKUP($D:$D,基础资料!$A:C,3,0)","v":"S-机械实践"},{"$f":"VLOOKUP($D:$D,基础资料!$A:D,4,0)","v":"\\"},{"$f":"VLOOKUP($D:$D,基础资料!$A:E,5,0)","v":"本"},{"$f":"VLOOKUP($D:$D,基础资料!$A:F,6,0)","v":"书本"},null,null,513,{"$f":"SUMIF($D:$D,D97,$L:$L)+SUMIF($D:$D,D97,$J:$J)-SUMIF($D:$D,D97,$K:$K)","v":463},{"$f":"VLOOKUP(D:D,结存!A:J,10,0)","v":463},{"$f":"M97 - N97","v":0}]
[null,null,null,629,{"$f":"VLOOKUP($D:$D,基础资料!$A:B,2,0)","v":"07030005"},{"$f":"VLOOKUP($D:$D,基础资料!$A:C,3,0)","v":"蓝卡-穿越时空的少女  1BD+2DVD"},{"$f":"VLOOKUP($D:$D,基础资料!$A:D,4,0)","v":"3"},{"$f":"VLOOKUP($D:$D,基础资料!$A:E,5,0)","v":"套"},{"$f":"VLOOKUP($D:$D,基础资料!$A:F,6,0)","v":"蓝光卡通"},null,null,77,{"$f":"SUMIF($D:$D,D98,$L:$L)+SUMIF($D:$D,D98,$J:$J)-SUMIF($D:$D,D98,$K:$K)","v":77},{"$f":"VLOOKUP(D:D,结存!A:J,10,0)","v":77},{"$f":"M98 - N98","v":0}]
[null,null,null,676,{"$f":"VLOOKUP($D:$D,基础资料!$A:B,2,0)","v":"07040034"},{"$f":"VLOOKUP($D:$D,基础资料!$A:C,3,0)","v":"S-程序员考试"},{"$f":"VLOOKUP($D:$D,基础资料!$A:D,4,0)","v":"\\"},{"$f":"VLOOKUP($D:$D,基础资料!$A:E,5,0)","v":"本"},{"$f":"VLOOKUP($D:$D,基础资料!$A:F,6,0)","v":"书本"},null,null,1422,{"$f":"SUMIF($D:$D,D99,$L:$L)+SUMIF($D:$D,D99,$J:$J)-SUMIF($D:$D,D99,$K:$K)","v":1412},{"$f":"VLOOKUP(D:D,结存!A:J,10,0)","v":1412},{"$f":"M99 - N99","v":0}]
["2016-10-25","1080047",null,607,{"$f":"VLOOKUP($D:$D,基础资料!$A:B,2,0)","v":"07020039"},{"$f":"VLOOKUP($D:$D,基础资料!$A:C,3,0)","v":"蓝影-钢之炼金术师：兄弟会（上）  4BD"},{"$f":"VLOOKUP($D:$D,基础资料!$A:D,4,0)","v":"4"},{"$f":"VLOOKUP($D:$D,基础资料!$A:E,5,0)","v":"套"},{"$f":"VLOOKUP($D:$D,基础资料!$A:F,6,0)","v":"蓝光电影"},null,5,null,{"$f":"SUMIF($D:$D,D100,$L:$L)+SUMIF($D:$D,D100,$J:$J)-SUMIF($D:$D,D100,$K:$K)","v":72},{"$f":"VLOOKUP(D:D,结存!A:J,10,0)","v":72},{"$f":"M100 - N100","v":0}]
["2016-10-25","1080047",null,608,{"$f":"VLOOKUP($D:$D,基础资料!$A:B,2,0)","v":"07020040"},{"$f":"VLOOKUP($D:$D,基础资料!$A:C,3,0)","v":"蓝影-钢之炼金术师：兄弟会（下）  4BD"},{"$f":"VLOOKUP($D:$D,基础资料!$A:D,4,0)","v":"4"},{"$f":"VLOOKUP($D:$D,基础资料!$A:E,5,0)","v":"套"},{"$f":"VLOOKUP($D:$D,基础资料!$A:F,6,0)","v":"蓝光电影"},null,5,null,{"$f":"SUMIF($D:$D,D101,$L:$L)+SUMIF($D:$D,D101,$J:$J)-SUMIF($D:$D,D101,$K:$K)","v":77},{"$f":"VLOOKUP(D:D,结存!A:J,10,0)","v":77},{"$f":"M101 - N101","v":0}]
["2016-10-25","10Y0049",null,640,{"$f":"VLOOKUP($D:$D,基础资料!$A:B,2,0)","v":"0704000035"},{"$f":"VLOOKUP($D:$D,基础资料!$A:C,3,0)","v":"S-商业：一个不断变化的世界"},{"$f":"VLOOKUP($D:$D,基础资料!$A:D,4,0)","v":"\\"},{"$f":"VLOOKUP($D:$D,基础资料!$A:E,5,0)","v":"本"},{"$f":"VLOOKUP($D:$D,基础资料!$A:F,6,0)","v":"书本"},null,10,null,{"$f":"SUMIF($D:$D,D102,$L:$L)+SUMIF($D:$D,D102,$J:$J)-SUMIF($D:$D,D102,$K:$K)","v":474},{"$f":"VLOOKUP(D:D,结存!A:J,10,0)","v":474},{"$f":"M102 - N102","v":0}]
["2016-10-25","10Y0041",null,644,{"$f":"VLOOKUP($D:$D,基础资料!$A:B,2,0)","v":"0704000293"},{"$f":"VLOOKUP($D:$D,基础资料!$A:C,3,0)","v":"S-环境经济学"},{"$f":"VLOOKUP($D:$D,基础资料!$A:D,4,0)","v":"\\"},{"$f":"VLOOKUP($D:$D,基础资料!$A:E,5,0)","v":"本"},{"$f":"VLOOKUP($D:$D,基础资料!$A:F,6,0)","v":"书本"},null,100,null,{"$f":"SUMIF($D:$D,D103,$L:$L)+SUMIF($D:$D,D103,$J:$J)-SUMIF($D:$D,D103,$K:$K)","v":419},{"$f":"VLOOKUP(D:D,结存!A:J,10,0)","v":419},{"$f":"M103 - N103","v":0}]
["2016-10-25","10Y0049",null,648,{"$f":"VLOOKUP($D:$D,基础资料!$A:B,2,0)","v":"07040006"},{"$f":"VLOOKUP($D:$D,基础资料!$A:C,3,0)","v":"S-大众传媒法"},{"$f":"VLOOKUP($D:$D,基础资料!$A:D,4,0)","v":"\\"},{"$f":"VLOOKUP($D:$D,基础资料!$A:E,5,0)","v":"本"},{"$f":"VLOOKUP($D:$D,基础资料!$A:F,6,0)","v":"书本"},null,50,null,{"$f":"SUMIF($D:$D,D104,$L:$L)+SUMIF($D:$D,D104,$J:$J)-SUMIF($D:$D,D104,$K:$K)","v":19},{"$f":"VLOOKUP(D:D,结存!A:J,10,0)","v":19},{"$f":"M104 - N104","v":0}]
["2016-10-26","0000000027",null,539,{"$f":"VLOOKUP($D:$D,基础资料!$A:B,2,0)","v":"07010013"},{"$f":"VLOOKUP($D:$D,基础资料!$A:C,3,0)","v":"蓝剧-黑色孤儿第3季  2BD"},{"$f":"VLOOKUP($D:$D,基础资料!$A:D,4,0)","v":"2"},{"$f":"VLOOKUP($D:$D,基础资料!$A:E,5,0)","v":"套"},{"$f":"VLOOKUP($D:$D,基础资料!$A:F,6,0)","v":"蓝光电视剧"},4,null,null,{"$f":"SUMIF($D:$D,D105,$L:$L)+SUMIF($D:$D,D105,$J:$J)-SUMIF($D:$D,D105,$K:$K)","v":86},{"$f":"VLOOKUP(D:D,结存!A:J,10,0)","v":86},{"$f":"M105 - N105","v":0}]
["2016-10-26","0000000028",null,568,{"$f":"VLOOKUP($D:$D,基础资料!$A:B,2,0)","v":"0702000032"},{"$f":"VLOOKUP($D:$D,基础资料!$A:C,3,0)","v":"蓝影年轻气盛1BD"},{"$f":"VLOOKUP($D:$D,基础资料!$A:D,4,0)","v":"1"},{"$f":"VLOOKUP($D:$D,基础资料!$A:E,5,0)","v":"套"},{"$f":"VLOOKUP($D:$D,基础资料!$A:F,6,0)","v":"蓝光电影"},1,null,null,{"$f":"SUMIF($D:$D,D106,$L:$L)+SUMIF($D:$D,D106,$J:$J)-SUMIF($D:$D,D106,$K:$K)","v":95},{"$f":"VLOOKUP(D:D,结存!A:J,10,0)","v":95},{"$f":"M106 - N106","v":0}]
["2016-10-26","1080052",null,568,{"$f":"VLOOKUP($D:$D,基础资料!$A:B,2,0)","v":"0702000032"},{"$f":"VLOOKUP($D:$D,基础资料!$A:C,3,0)","v":"蓝影年轻气盛1BD"},{"$f":"VLOOKUP($D:$D,基础资料!$A:D,4,0)","v":"1"},{"$f":"VLOOKUP($D:$D,基础资料!$A:E,5,0)","v":"套"},{"$f":"VLOOKUP($D:$D,基础资料!$A:F,6,0)","v":"蓝光电影"},null,1,null,{"$f":"SUMIF($D:$D,D107,$L:$L)+SUMIF($D:$D,D107,$J:$J)-SUMIF($D:$D,D107,$K:$K)","v":95},{"$f":"VLOOKUP(D:D,结存!A:J,10,0)","v":95},{"$f":"M107 - N107","v":0}]
["2016-10-26","1080052",null,590,{"$f":"VLOOKUP($D:$D,基础资料!$A:B,2,0)","v":"07020022"},{"$f":"VLOOKUP($D:$D,基础资料!$A:C,3,0)","v":"蓝影-美国不为人知的历史 1BD"},{"$f":"VLOOKUP($D:$D,基础资料!$A:D,4,0)","v":"1"},{"$f":"VLOOKUP($D:$D,基础资料!$A:E,5,0)","v":"套"},{"$f":"VLOOKUP($D:$D,基础资料!$A:F,6,0)","v":"蓝光电影"},null,1,null,{"$f":"SUMIF($D:$D,D108,$L:$L)+SUMIF($D:$D,D108,$J:$J)-SUMIF($D:$D,D108,$K:$K)","v":88},{"$f":"VLOOKUP(D:D,结存!A:J,10,0)","v":88},{"$f":"M108 - N108","v":0}]
["2016-10-26",null,null,594,{"$f":"VLOOKUP($D:$D,基础资料!$A:B,2,0)","v":"07020026"},{"$f":"VLOOKUP($D:$D,基础资料!$A:C,3,0)","v":"蓝影-耐撕侦探1BD+1DVD"},{"$f":"VLOOKUP($D:$D,基础资料!$A:D,4,0)","v":"2"},{"$f":"VLOOKUP($D:$D,基础资料!$A:E,5,0)","v":"套"},{"$f":"VLOOKUP($D:$D,基础资料!$A:F,6,0)","v":"蓝光电影"},1,null,null,{"$f":"SUMIF($D:$D,D109,$L:$L)+SUMIF($D:$D,D109,$J:$J)-SUMIF($D:$D,D109,$K:$K)","v":95},{"$f":"VLOOKUP(D:D,结存!A:J,10,0)","v":95},{"$f":"M109 - N109","v":0}]
["2016-10-26","1080052",null,594,{"$f":"VLOOKUP($D:$D,基础资料!$A:B,2,0)","v":"07020026"},{"$f":"VLOOKUP($D:$D,基础资料!$A:C,3,0)","v":"蓝影-耐撕侦探1BD+1DVD"},{"$f":"VLOOKUP($D:$D,基础资料!$A:D,4,0)","v":"2"},{"$f":"VLOOKUP($D:$D,基础资料!$A:E,5,0)","v":"套"},{"$f":"VLOOKUP($D:$D,基础资料!$A:F,6,0)","v":"蓝光电影"},null,1,null,{"$f":"SUMIF($D:$D,D110,$L:$L)+SUMIF($D:$D,D110,$J:$J)-SUMIF($D:$D,D110,$K:$K)","v":95},{"$f":"VLOOKUP(D:D,结存!A:J,10,0)","v":95},{"$f":"M110 - N110","v":0}]
["2016-10-26","1080052",null,599,{"$f":"VLOOKUP($D:$D,基础资料!$A:B,2,0)","v":"07020031"},{"$f":"VLOOKUP($D:$D,基础资料!$A:C,3,0)","v":"蓝影-杀死一只知更鸟1BD"},{"$f":"VLOOKUP($D:$D,基础资料!$A:D,4,0)","v":"1"},{"$f":"VLOOKUP($D:$D,基础资料!$A:E,5,0)","v":"套"},{"$f":"VLOOKUP($D:$D,基础资料!$A:F,6,0)","v":"蓝光电影"},null,1,null,{"$f":"SUMIF($D:$D,D111,$L:$L)+SUMIF($D:$D,D111,$J:$J)-SUMIF($D:$D,D111,$K:$K)","v":78},{"$f":"VLOOKUP(D:D,结存!A:J,10,0)","v":78},{"$f":"M111 - N111","v":0}]
["2016-10-26","1080049",null,607,{"$f":"VLOOKUP($D:$D,基础资料!$A:B,2,0)","v":"07020039"},{"$f":"VLOOKUP($D:$D,基础资料!$A:C,3,0)","v":"蓝影-钢之炼金术师：兄弟会（上）  4BD"},{"$f":"VLOOKUP($D:$D,基础资料!$A:D,4,0)","v":"4"},{"$f":"VLOOKUP($D:$D,基础资料!$A:E,5,0)","v":"套"},{"$f":"VLOOKUP($D:$D,基础资料!$A:F,6,0)","v":"蓝光电影"},null,4,null,{"$f":"SUMIF($D:$D,D112,$L:$L)+SUMIF($D:$D,D112,$J:$J)-SUMIF($D:$D,D112,$K:$K)","v":72},{"$f":"VLOOKUP(D:D,结存!A:J,10,0)","v":72},{"$f":"M112 - N112","v":0}]
["2016-10-26","1080050",null,633,{"$f":"VLOOKUP($D:$D,基础资料!$A:B,2,0)","v":"07030009"},{"$f":"VLOOKUP($D:$D,基础资料!$A:C,3,0)","v":"蓝卡-星际牛仔  4BD"},{"$f":"VLOOKUP($D:$D,基础资料!$A:D,4,0)","v":"4"},{"$f":"VLOOKUP($D:$D,基础资料!$A:E,5,0)","v":"套"},{"$f":"VLOOKUP($D:$D,基础资料!$A:F,6,0)","v":"蓝光卡通"},null,2,null,{"$f":"SUMIF($D:$D,D113,$L:$L)+SUMIF($D:$D,D113,$J:$J)-SUMIF($D:$D,D113,$K:$K)","v":9},{"$f":"VLOOKUP(D:D,结存!A:J,10,0)","v":9},{"$f":"M113 - N113","v":0}]
["2016-10-26","‘0000000003",null,688,{"$f":"VLOOKUP($D:$D,基础资料!$A:B,2,0)","v":9090003},{"$f":"VLOOKUP($D:$D,基础资料!$A:C,3,0)","v":"蓝光瑞壳和莫蒂第1季1BD"},{"$f":"VLOOKUP($D:$D,基础资料!$A:D,4,0)","v":"\\"},{"$f":"VLOOKUP($D:$D,基础资料!$A:E,5,0)","v":"套"},{"$f":"VLOOKUP($D:$D,基础资料!$A:F,6,0)","v":"蓝光电影"},1,null,null,{"$f":"SUMIF($D:$D,D114,$L:$L)+SUMIF($D:$D,D114,$J:$J)-SUMIF($D:$D,D114,$K:$K)","v":0},{"$f":"VLOOKUP(D:D,结存!A:J,10,0)","v":0},{"$f":"M114 - N114","v":0}]
["2016-10-26","1080051",null,688,{"$f":"VLOOKUP($D:$D,基础资料!$A:B,2,0)","v":9090003},{"$f":"VLOOKUP($D:$D,基础资料!$A:C,3,0)","v":"蓝光瑞壳和莫蒂第1季1BD"},{"$f":"VLOOKUP($D:$D,基础资料!$A:D,4,0)","v":"\\"},{"$f":"VLOOKUP($D:$D,基础资料!$A:E,5,0)","v":"套"},{"$f":"VLOOKUP($D:$D,基础资料!$A:F,6,0)","v":"蓝光电影"},null,1,null,{"$f":"SUMIF($D:$D,D115,$L:$L)+SUMIF($D:$D,D115,$J:$J)-SUMIF($D:$D,D115,$K:$K)","v":0},{"$f":"VLOOKUP(D:D,结存!A:J,10,0)","v":0},{"$f":"M115 - N115","v":0}]
["2016-10-26",null,null,578,{"$f":"VLOOKUP($D:$D,基础资料!$A:B,2,0)","v":"07020010"},{"$f":"VLOOKUP($D:$D,基础资料!$A:C,3,0)","v":"蓝影-功夫熊猫21BD+2DVD"},{"$f":"VLOOKUP($D:$D,基础资料!$A:D,4,0)","v":"3"},{"$f":"VLOOKUP($D:$D,基础资料!$A:E,5,0)","v":"套"},{"$f":"VLOOKUP($D:$D,基础资料!$A:F,6,0)","v":"蓝光电影"},null,8,null,{"$f":"SUMIF($D:$D,D116,$L:$L)+SUMIF($D:$D,D116,$J:$J)-SUMIF($D:$D,D116,$K:$K)","v":81},{"$f":"VLOOKUP(D:D,结存!A:J,10,0)","v":81},{"$f":"M116 - N116","v":0}]
["2016-10-26",null,null,579,{"$f":"VLOOKUP($D:$D,基础资料!$A:B,2,0)","v":"07020011"},{"$f":"VLOOKUP($D:$D,基础资料!$A:C,3,0)","v":"蓝影-功夫熊猫3  1BD+1DVD"},{"$f":"VLOOKUP($D:$D,基础资料!$A:D,4,0)","v":"2"},{"$f":"VLOOKUP($D:$D,基础资料!$A:E,5,0)","v":"套"},{"$f":"VLOOKUP($D:$D,基础资料!$A:F,6,0)","v":"蓝光电影"},null,8,null,{"$f":"SUMIF($D:$D,D117,$L:$L)+SUMIF($D:$D,D117,$J:$J)-SUMIF($D:$D,D117,$K:$K)","v":67},{"$f":"VLOOKUP(D:D,结存!A:J,10,0)","v":67},{"$f":"M117 - N117","v":0}]
["2016-10-27","10Y0055",null,636,{"$f":"VLOOKUP($D:$D,基础资料!$A:B,2,0)","v":"0704000001"},{"$f":"VLOOKUP($D:$D,基础资料!$A:C,3,0)","v":"S-内识心理学"},{"$f":"VLOOKUP($D:$D,基础资料!$A:D,4,0)","v":"\\"},{"$f":"VLOOKUP($D:$D,基础资料!$A:E,5,0)","v":"本"},{"$f":"VLOOKUP($D:$D,基础资料!$A:F,6,0)","v":"书本"},null,52,null,{"$f":"SUMIF($D:$D,D118,$L:$L)+SUMIF($D:$D,D118,$J:$J)-SUMIF($D:$D,D118,$K:$K)","v":656},{"$f":"VLOOKUP(D:D,结存!A:J,10,0)","v":656},{"$f":"M118 - N118","v":0}]
["2016-10-27","10Y0055",null,637,{"$f":"VLOOKUP($D:$D,基础资料!$A:B,2,0)","v":"0704000002"},{"$f":"VLOOKUP($D:$D,基础资料!$A:C,3,0)","v":"S-项目评价"},{"$f":"VLOOKUP($D:$D,基础资料!$A:D,4,0)","v":"\\"},{"$f":"VLOOKUP($D:$D,基础资料!$A:E,5,0)","v":"本"},{"$f":"VLOOKUP($D:$D,基础资料!$A:F,6,0)","v":"书本"},null,4,null,{"$f":"SUMIF($D:$D,D119,$L:$L)+SUMIF($D:$D,D119,$J:$J)-SUMIF($D:$D,D119,$K:$K)","v":1877},{"$f":"VLOOKUP(D:D,结存!A:J,10,0)","v":1877},{"$f":"M119 - N119","v":0}]
["2016-10-27","10Y0055",null,639,{"$f":"VLOOKUP($D:$D,基础资料!$A:B,2,0)","v":"0704000004"},{"$f":"VLOOKUP($D:$D,基础资料!$A:C,3,0)","v":"S-电器查询"},{"$f":"VLOOKUP($D:$D,基础资料!$A:D,4,0)","v":"\\"},{"$f":"VLOOKUP($D:$D,基础资料!$A:E,5,0)","v":"本"},{"$f":"VLOOKUP($D:$D,基础资料!$A:F,6,0)","v":"书本"},null,15,null,{"$f":"SUMIF($D:$D,D120,$L:$L)+SUMIF($D:$D,D120,$J:$J)-SUMIF($D:$D,D120,$K:$K)","v":223},{"$f":"VLOOKUP(D:D,结存!A:J,10,0)","v":223},{"$f":"M120 - N120","v":0}]
["2016-10-27","10Y0055",null,640,{"$f":"VLOOKUP($D:$D,基础资料!$A:B,2,0)","v":"0704000035"},{"$f":"VLOOKUP($D:$D,基础资料!$A:C,3,0)","v":"S-商业：一个不断变化的世界"},{"$f":"VLOOKUP($D:$D,基础资料!$A:D,4,0)","v":"\\"},{"$f":"VLOOKUP($D:$D,基础资料!$A:E,5,0)","v":"本"},{"$f":"VLOOKUP($D:$D,基础资料!$A:F,6,0)","v":"书本"},null,3,null,{"$f":"SUMIF($D:$D,D121,$L:$L)+SUMIF($D:$D,D121,$J:$J)-SUMIF($D:$D,D121,$K:$K)","v":474},{"$f":"VLOOKUP(D:D,结存!A:J,10,0)","v":474},{"$f":"M121 - N121","v":0}]
["2016-10-27","10Y0055",null,641,{"$f":"VLOOKUP($D:$D,基础资料!$A:B,2,0)","v":"0704000036"},{"$f":"VLOOKUP($D:$D,基础资料!$A:C,3,0)","v":"S-我们的人民"},{"$f":"VLOOKUP($D:$D,基础资料!$A:D,4,0)","v":"\\"},{"$f":"VLOOKUP($D:$D,基础资料!$A:E,5,0)","v":"本"},{"$f":"VLOOKUP($D:$D,基础资料!$A:F,6,0)","v":"书本"},null,3,null,{"$f":"SUMIF($D:$D,D122,$L:$L)+SUMIF($D:$D,D122,$J:$J)-SUMIF($D:$D,D122,$K:$K)","v":2685},{"$f":"VLOOKUP(D:D,结存!A:J,10,0)","v":2685},{"$f":"M122 - N122","v":0}]
["2016-10-27","10Y0054",null,644,{"$f":"VLOOKUP($D:$D,基础资料!$A:B,2,0)","v":"0704000293"},{"$f":"VLOOKUP($D:$D,基础资料!$A:C,3,0)","v":"S-环境经济学"},{"$f":"VLOOKUP($D:$D,基础资料!$A:D,4,0)","v":"\\"},{"$f":"VLOOKUP($D:$D,基础资料!$A:E,5,0)","v":"本"},{"$f":"VLOOKUP($D:$D,基础资料!$A:F,6,0)","v":"书本"},null,null,null,{"$f":"SUMIF($D:$D,D123,$L:$L)+SUMIF($D:$D,D123,$J:$J)-SUMIF($D:$D,D123,$K:$K)","v":419},{"$f":"VLOOKUP(D:D,结存!A:J,10,0)","v":419},{"$f":"M123 - N123","v":0}]
["2016-10-27","10Y0054",null,644,{"$f":"VLOOKUP($D:$D,基础资料!$A:B,2,0)","v":"0704000293"},{"$f":"VLOOKUP($D:$D,基础资料!$A:C,3,0)","v":"S-环境经济学"},{"$f":"VLOOKUP($D:$D,基础资料!$A:D,4,0)","v":"\\"},{"$f":"VLOOKUP($D:$D,基础资料!$A:E,5,0)","v":"本"},{"$f":"VLOOKUP($D:$D,基础资料!$A:F,6,0)","v":"书本"},null,36,null,{"$f":"SUMIF($D:$D,D124,$L:$L)+SUMIF($D:$D,D124,$J:$J)-SUMIF($D:$D,D124,$K:$K)","v":419},{"$f":"VLOOKUP(D:D,结存!A:J,10,0)","v":419},{"$f":"M124 - N124","v":0}]
["2016-10-27","10Y0055",null,649,{"$f":"VLOOKUP($D:$D,基础资料!$A:B,2,0)","v":"07040007"},{"$f":"VLOOKUP($D:$D,基础资料!$A:C,3,0)","v":"S-行为研究方法"},{"$f":"VLOOKUP($D:$D,基础资料!$A:D,4,0)","v":"\\"},{"$f":"VLOOKUP($D:$D,基础资料!$A:E,5,0)","v":"本"},{"$f":"VLOOKUP($D:$D,基础资料!$A:F,6,0)","v":"书本"},null,3,null,{"$f":"SUMIF($D:$D,D125,$L:$L)+SUMIF($D:$D,D125,$J:$J)-SUMIF($D:$D,D125,$K:$K)","v":4577},{"$f":"VLOOKUP(D:D,结存!A:J,10,0)","v":4577},{"$f":"M125 - N125","v":0}]
["2016-10-27","10Y0055",null,654,{"$f":"VLOOKUP($D:$D,基础资料!$A:B,2,0)","v":"07040012"},{"$f":"VLOOKUP($D:$D,基础资料!$A:C,3,0)","v":"S-实践研究"},{"$f":"VLOOKUP($D:$D,基础资料!$A:D,4,0)","v":"\\"},{"$f":"VLOOKUP($D:$D,基础资料!$A:E,5,0)","v":"本"},{"$f":"VLOOKUP($D:$D,基础资料!$A:F,6,0)","v":"书本"},null,3,null,{"$f":"SUMIF($D:$D,D126,$L:$L)+SUMIF($D:$D,D126,$J:$J)-SUMIF($D:$D,D126,$K:$K)","v":1966},{"$f":"VLOOKUP(D:D,结存!A:J,10,0)","v":1966},{"$f":"M126 - N126","v":0}]
["2016-10-27","10Y0055",null,661,{"$f":"VLOOKUP($D:$D,基础资料!$A:B,2,0)","v":"07040019"},{"$f":"VLOOKUP($D:$D,基础资料!$A:C,3,0)","v":"S-美国药疗保健"},{"$f":"VLOOKUP($D:$D,基础资料!$A:D,4,0)","v":"\\"},{"$f":"VLOOKUP($D:$D,基础资料!$A:E,5,0)","v":"本"},{"$f":"VLOOKUP($D:$D,基础资料!$A:F,6,0)","v":"书本"},null,3,null,{"$f":"SUMIF($D:$D,D127,$L:$L)+SUMIF($D:$D,D127,$J:$J)-SUMIF($D:$D,D127,$K:$K)","v":975},{"$f":"VLOOKUP(D:D,结存!A:J,10,0)","v":975},{"$f":"M127 - N127","v":0}]
["2016-10-28","10Y0056",null,645,{"$f":"VLOOKUP($D:$D,基础资料!$A:B,2,0)","v":"07040003"},{"$f":"VLOOKUP($D:$D,基础资料!$A:C,3,0)","v":"S-公共演讲的艺术"},{"$f":"VLOOKUP($D:$D,基础资料!$A:D,4,0)","v":"\\"},{"$f":"VLOOKUP($D:$D,基础资料!$A:E,5,0)","v":"本"},{"$f":"VLOOKUP($D:$D,基础资料!$A:F,6,0)","v":"书本"},null,10,null,{"$f":"SUMIF($D:$D,D128,$L:$L)+SUMIF($D:$D,D128,$J:$J)-SUMIF($D:$D,D128,$K:$K)","v":1403},{"$f":"VLOOKUP(D:D,结存!A:J,10,0)","v":1403},{"$f":"M128 - N128","v":0}]
["2016-10-28","10Y0056",null,637,{"$f":"VLOOKUP($D:$D,基础资料!$A:B,2,0)","v":"0704000002"},{"$f":"VLOOKUP($D:$D,基础资料!$A:C,3,0)","v":"S-项目评价"},{"$f":"VLOOKUP($D:$D,基础资料!$A:D,4,0)","v":"\\"},{"$f":"VLOOKUP($D:$D,基础资料!$A:E,5,0)","v":"本"},{"$f":"VLOOKUP($D:$D,基础资料!$A:F,6,0)","v":"书本"},null,10,null,{"$f":"SUMIF($D:$D,D129,$L:$L)+SUMIF($D:$D,D129,$J:$J)-SUMIF($D:$D,D129,$K:$K)","v":1877},{"$f":"VLOOKUP(D:D,结存!A:J,10,0)","v":1877},{"$f":"M129 - N129","v":0}]
["2016-10-28","10Y0056",null,636,{"$f":"VLOOKUP($D:$D,基础资料!$A:B,2,0)","v":"0704000001"},{"$f":"VLOOKUP($D:$D,基础资料!$A:C,3,0)","v":"S-内识心理学"},{"$f":"VLOOKUP($D:$D,基础资料!$A:D,4,0)","v":"\\"},{"$f":"VLOOKUP($D:$D,基础资料!$A:E,5,0)","v":"本"},{"$f":"VLOOKUP($D:$D,基础资料!$A:F,6,0)","v":"书本"},null,10,null,{"$f":"SUMIF($D:$D,D130,$L:$L)+SUMIF($D:$D,D130,$J:$J)-SUMIF($D:$D,D130,$K:$K)","v":656},{"$f":"VLOOKUP(D:D,结存!A:J,10,0)","v":656},{"$f":"M130 - N130","v":0}]
["2016-10-28","10Y0056",null,652,{"$f":"VLOOKUP($D:$D,基础资料!$A:B,2,0)","v":"07040010"},{"$f":"VLOOKUP($D:$D,基础资料!$A:C,3,0)","v":"S-管理技能养成"},{"$f":"VLOOKUP($D:$D,基础资料!$A:D,4,0)","v":"\\"},{"$f":"VLOOKUP($D:$D,基础资料!$A:E,5,0)","v":"本"},{"$f":"VLOOKUP($D:$D,基础资料!$A:F,6,0)","v":"书本"},null,10,null,{"$f":"SUMIF($D:$D,D131,$L:$L)+SUMIF($D:$D,D131,$J:$J)-SUMIF($D:$D,D131,$K:$K)","v":292},{"$f":"VLOOKUP(D:D,结存!A:J,10,0)","v":292},{"$f":"M131 - N131","v":0}]
["2016-10-28","10Y0056",null,640,{"$f":"VLOOKUP($D:$D,基础资料!$A:B,2,0)","v":"0704000035"},{"$f":"VLOOKUP($D:$D,基础资料!$A:C,3,0)","v":"S-商业：一个不断变化的世界"},{"$f":"VLOOKUP($D:$D,基础资料!$A:D,4,0)","v":"\\"},{"$f":"VLOOKUP($D:$D,基础资料!$A:E,5,0)","v":"本"},{"$f":"VLOOKUP($D:$D,基础资料!$A:F,6,0)","v":"书本"},null,10,null,{"$f":"SUMIF($D:$D,D132,$L:$L)+SUMIF($D:$D,D132,$J:$J)-SUMIF($D:$D,D132,$K:$K)","v":474},{"$f":"VLOOKUP(D:D,结存!A:J,10,0)","v":474},{"$f":"M132 - N132","v":0}]
["2016-10-28","10Y0056",null,650,{"$f":"VLOOKUP($D:$D,基础资料!$A:B,2,0)","v":"07040008"},{"$f":"VLOOKUP($D:$D,基础资料!$A:C,3,0)","v":"S-谈判精要"},{"$f":"VLOOKUP($D:$D,基础资料!$A:D,4,0)","v":"\\"},{"$f":"VLOOKUP($D:$D,基础资料!$A:E,5,0)","v":"本"},{"$f":"VLOOKUP($D:$D,基础资料!$A:F,6,0)","v":"书本"},null,10,null,{"$f":"SUMIF($D:$D,D133,$L:$L)+SUMIF($D:$D,D133,$J:$J)-SUMIF($D:$D,D133,$K:$K)","v":538},{"$f":"VLOOKUP(D:D,结存!A:J,10,0)","v":538},{"$f":"M133 - N133","v":0}]
["2016-10-28","10Y0056",null,641,{"$f":"VLOOKUP($D:$D,基础资料!$A:B,2,0)","v":"0704000036"},{"$f":"VLOOKUP($D:$D,基础资料!$A:C,3,0)","v":"S-我们的人民"},{"$f":"VLOOKUP($D:$D,基础资料!$A:D,4,0)","v":"\\"},{"$f":"VLOOKUP($D:$D,基础资料!$A:E,5,0)","v":"本"},{"$f":"VLOOKUP($D:$D,基础资料!$A:F,6,0)","v":"书本"},null,15,null,{"$f":"SUMIF($D:$D,D134,$L:$L)+SUMIF($D:$D,D134,$J:$J)-SUMIF($D:$D,D134,$K:$K)","v":2685},{"$f":"VLOOKUP(D:D,结存!A:J,10,0)","v":2685},{"$f":"M134 - N134","v":0}]
["2016-10-28","10Y0056",null,648,{"$f":"VLOOKUP($D:$D,基础资料!$A:B,2,0)","v":"07040006"},{"$f":"VLOOKUP($D:$D,基础资料!$A:C,3,0)","v":"S-大众传媒法"},{"$f":"VLOOKUP($D:$D,基础资料!$A:D,4,0)","v":"\\"},{"$f":"VLOOKUP($D:$D,基础资料!$A:E,5,0)","v":"本"},{"$f":"VLOOKUP($D:$D,基础资料!$A:F,6,0)","v":"书本"},null,10,null,{"$f":"SUMIF($D:$D,D135,$L:$L)+SUMIF($D:$D,D135,$J:$J)-SUMIF($D:$D,D135,$K:$K)","v":19},{"$f":"VLOOKUP(D:D,结存!A:J,10,0)","v":19},{"$f":"M135 - N135","v":0}]
["2016-10-28","10Y0056",null,663,{"$f":"VLOOKUP($D:$D,基础资料!$A:B,2,0)","v":"07040021"},{"$f":"VLOOKUP($D:$D,基础资料!$A:C,3,0)","v":"S-面试技巧"},{"$f":"VLOOKUP($D:$D,基础资料!$A:D,4,0)","v":"\\"},{"$f":"VLOOKUP($D:$D,基础资料!$A:E,5,0)","v":"本"},{"$f":"VLOOKUP($D:$D,基础资料!$A:F,6,0)","v":"书本"},null,20,null,{"$f":"SUMIF($D:$D,D136,$L:$L)+SUMIF($D:$D,D136,$J:$J)-SUMIF($D:$D,D136,$K:$K)","v":595},{"$f":"VLOOKUP(D:D,结存!A:J,10,0)","v":595},{"$f":"M136 - N136","v":0}]
["2016-10-28","10Y0056",null,636,{"$f":"VLOOKUP($D:$D,基础资料!$A:B,2,0)","v":"0704000001"},{"$f":"VLOOKUP($D:$D,基础资料!$A:C,3,0)","v":"S-内识心理学"},{"$f":"VLOOKUP($D:$D,基础资料!$A:D,4,0)","v":"\\"},{"$f":"VLOOKUP($D:$D,基础资料!$A:E,5,0)","v":"本"},{"$f":"VLOOKUP($D:$D,基础资料!$A:F,6,0)","v":"书本"},null,2,null,{"$f":"SUMIF($D:$D,D137,$L:$L)+SUMIF($D:$D,D137,$J:$J)-SUMIF($D:$D,D137,$K:$K)","v":656},{"$f":"VLOOKUP(D:D,结存!A:J,10,0)","v":656},{"$f":"M137 - N137","v":0}]
["2016-10-28","10Y0056",null,652,{"$f":"VLOOKUP($D:$D,基础资料!$A:B,2,0)","v":"07040010"},{"$f":"VLOOKUP($D:$D,基础资料!$A:C,3,0)","v":"S-管理技能养成"},{"$f":"VLOOKUP($D:$D,基础资料!$A:D,4,0)","v":"\\"},{"$f":"VLOOKUP($D:$D,基础资料!$A:E,5,0)","v":"本"},{"$f":"VLOOKUP($D:$D,基础资料!$A:F,6,0)","v":"书本"},null,2,null,{"$f":"SUMIF($D:$D,D138,$L:$L)+SUMIF($D:$D,D138,$J:$J)-SUMIF($D:$D,D138,$K:$K)","v":292},{"$f":"VLOOKUP(D:D,结存!A:J,10,0)","v":292},{"$f":"M138 - N138","v":0}]
["2016-10-28","10Y0056",null,637,{"$f":"VLOOKUP($D:$D,基础资料!$A:B,2,0)","v":"0704000002"},{"$f":"VLOOKUP($D:$D,基础资料!$A:C,3,0)","v":"S-项目评价"},{"$f":"VLOOKUP($D:$D,基础资料!$A:D,4,0)","v":"\\"},{"$f":"VLOOKUP($D:$D,基础资料!$A:E,5,0)","v":"本"},{"$f":"VLOOKUP($D:$D,基础资料!$A:F,6,0)","v":"书本"},null,1,null,{"$f":"SUMIF($D:$D,D139,$L:$L)+SUMIF($D:$D,D139,$J:$J)-SUMIF($D:$D,D139,$K:$K)","v":1877},{"$f":"VLOOKUP(D:D,结存!A:J,10,0)","v":1877},{"$f":"M139 - N139","v":0}]
["2016-10-28","1080055",null,536,{"$f":"VLOOKUP($D:$D,基础资料!$A:B,2,0)","v":"07010010"},{"$f":"VLOOKUP($D:$D,基础资料!$A:C,3,0)","v":"蓝剧-黑色孤儿第1季  2BD"},{"$f":"VLOOKUP($D:$D,基础资料!$A:D,4,0)","v":"2"},{"$f":"VLOOKUP($D:$D,基础资料!$A:E,5,0)","v":"套"},{"$f":"VLOOKUP($D:$D,基础资料!$A:F,6,0)","v":"蓝光电视剧"},null,1,null,{"$f":"SUMIF($D:$D,D140,$L:$L)+SUMIF($D:$D,D140,$J:$J)-SUMIF($D:$D,D140,$K:$K)","v":104},{"$f":"VLOOKUP(D:D,结存!A:J,10,0)","v":85},{"$f":"M140 - N140","v":19}]
["2016-10-28","1080055",null,537,{"$f":"VLOOKUP($D:$D,基础资料!$A:B,2,0)","v":"07010011"},{"$f":"VLOOKUP($D:$D,基础资料!$A:C,3,0)","v":"蓝剧-黑色孤儿第2季  2BD"},{"$f":"VLOOKUP($D:$D,基础资料!$A:D,4,0)","v":"2"},{"$f":"VLOOKUP($D:$D,基础资料!$A:E,5,0)","v":"套"},{"$f":"VLOOKUP($D:$D,基础资料!$A:F,6,0)","v":"蓝光电视剧"},null,1,null,{"$f":"SUMIF($D:$D,D141,$L:$L)+SUMIF($D:$D,D141,$J:$J)-SUMIF($D:$D,D141,$K:$K)","v":98},{"$f":"VLOOKUP(D:D,结存!A:J,10,0)","v":79},{"$f":"M141 - N141","v":19}]
["2016-10-28","1080055",null,539,{"$f":"VLOOKUP($D:$D,基础资料!$A:B,2,0)","v":"07010013"},{"$f":"VLOOKUP($D:$D,基础资料!$A:C,3,0)","v":"蓝剧-黑色孤儿第3季  2BD"},{"$f":"VLOOKUP($D:$D,基础资料!$A:D,4,0)","v":"2"},{"$f":"VLOOKUP($D:$D,基础资料!$A:E,5,0)","v":"套"},{"$f":"VLOOKUP($D:$D,基础资料!$A:F,6,0)","v":"蓝光电视剧"},null,1,null,{"$f":"SUMIF($D:$D,D142,$L:$L)+SUMIF($D:$D,D142,$J:$J)-SUMIF($D:$D,D142,$K:$K)","v":86},{"$f":"VLOOKUP(D:D,结存!A:J,10,0)","v":86},{"$f":"M142 - N142","v":0}]
["2016-10-28","1080055",null,541,{"$f":"VLOOKUP($D:$D,基础资料!$A:B,2,0)","v":"07010015"},{"$f":"VLOOKUP($D:$D,基础资料!$A:C,3,0)","v":"蓝剧-黑色孤儿第4季  2BD"},{"$f":"VLOOKUP($D:$D,基础资料!$A:D,4,0)","v":"2"},{"$f":"VLOOKUP($D:$D,基础资料!$A:E,5,0)","v":"套"},{"$f":"VLOOKUP($D:$D,基础资料!$A:F,6,0)","v":"蓝光电视剧"},null,1,null,{"$f":"SUMIF($D:$D,D143,$L:$L)+SUMIF($D:$D,D143,$J:$J)-SUMIF($D:$D,D143,$K:$K)","v":63},{"$f":"VLOOKUP(D:D,结存!A:J,10,0)","v":63},{"$f":"M143 - N143","v":0}]
["2016-10-28","1080054",null,573,{"$f":"VLOOKUP($D:$D,基础资料!$A:B,2,0)","v":"07020005"},{"$f":"VLOOKUP($D:$D,基础资料!$A:C,3,0)","v":"蓝影-猫王:是这样的:特别版  1BD+1DVD"},{"$f":"VLOOKUP($D:$D,基础资料!$A:D,4,0)","v":"2"},{"$f":"VLOOKUP($D:$D,基础资料!$A:E,5,0)","v":"套"},{"$f":"VLOOKUP($D:$D,基础资料!$A:F,6,0)","v":"蓝光电影"},null,1,null,{"$f":"SUMIF($D:$D,D144,$L:$L)+SUMIF($D:$D,D144,$J:$J)-SUMIF($D:$D,D144,$K:$K)","v":69},{"$f":"VLOOKUP(D:D,结存!A:J,10,0)","v":69},{"$f":"M144 - N144","v":0}]
["2016-10-28","1080054",null,588,{"$f":"VLOOKUP($D:$D,基础资料!$A:B,2,0)","v":"07020020"},{"$f":"VLOOKUP($D:$D,基础资料!$A:C,3,0)","v":"蓝影-猫王-埃尔维斯之旅 1BD"},{"$f":"VLOOKUP($D:$D,基础资料!$A:D,4,0)","v":"1"},{"$f":"VLOOKUP($D:$D,基础资料!$A:E,5,0)","v":"套"},{"$f":"VLOOKUP($D:$D,基础资料!$A:F,6,0)","v":"蓝光电影"},null,1,null,{"$f":"SUMIF($D:$D,D145,$L:$L)+SUMIF($D:$D,D145,$J:$J)-SUMIF($D:$D,D145,$K:$K)","v":96},{"$f":"VLOOKUP(D:D,结存!A:J,10,0)","v":96},{"$f":"M145 - N145","v":0}]
["2016-10-28",null,null,583,{"$f":"VLOOKUP($D:$D,基础资料!$A:B,2,0)","v":"07020015"},{"$f":"VLOOKUP($D:$D,基础资料!$A:C,3,0)","v":"蓝影-元气囝仔 2BD+2DVD"},{"$f":"VLOOKUP($D:$D,基础资料!$A:D,4,0)","v":"4"},{"$f":"VLOOKUP($D:$D,基础资料!$A:E,5,0)","v":"套"},{"$f":"VLOOKUP($D:$D,基础资料!$A:F,6,0)","v":"蓝光电影"},null,4,null,{"$f":"SUMIF($D:$D,D146,$L:$L)+SUMIF($D:$D,D146,$J:$J)-SUMIF($D:$D,D146,$K:$K)","v":94},{"$f":"VLOOKUP(D:D,结存!A:J,10,0)","v":94},{"$f":"M146 - N146","v":0}]
["2016-10-28",null,null,633,{"$f":"VLOOKUP($D:$D,基础资料!$A:B,2,0)","v":"07030009"},{"$f":"VLOOKUP($D:$D,基础资料!$A:C,3,0)","v":"蓝卡-星际牛仔  4BD"},{"$f":"VLOOKUP($D:$D,基础资料!$A:D,4,0)","v":"4"},{"$f":"VLOOKUP($D:$D,基础资料!$A:E,5,0)","v":"套"},{"$f":"VLOOKUP($D:$D,基础资料!$A:F,6,0)","v":"蓝光卡通"},null,6,null,{"$f":"SUMIF($D:$D,D147,$L:$L)+SUMIF($D:$D,D147,$J:$J)-SUMIF($D:$D,D147,$K:$K)","v":9},{"$f":"VLOOKUP(D:D,结存!A:J,10,0)","v":9},{"$f":"M147 - N147","v":0}]
["2016-10-28",null,null,607,{"$f":"VLOOKUP($D:$D,基础资料!$A:B,2,0)","v":"07020039"},{"$f":"VLOOKUP($D:$D,基础资料!$A:C,3,0)","v":"蓝影-钢之炼金术师：兄弟会（上）  4BD"},{"$f":"VLOOKUP($D:$D,基础资料!$A:D,4,0)","v":"4"},{"$f":"VLOOKUP($D:$D,基础资料!$A:E,5,0)","v":"套"},{"$f":"VLOOKUP($D:$D,基础资料!$A:F,6,0)","v":"蓝光电影"},null,4,null,{"$f":"SUMIF($D:$D,D148,$L:$L)+SUMIF($D:$D,D148,$J:$J)-SUMIF($D:$D,D148,$K:$K)","v":72},{"$f":"VLOOKUP(D:D,结存!A:J,10,0)","v":72},{"$f":"M148 - N148","v":0}]
["2016-10-28",null,null,608,{"$f":"VLOOKUP($D:$D,基础资料!$A:B,2,0)","v":"07020040"},{"$f":"VLOOKUP($D:$D,基础资料!$A:C,3,0)","v":"蓝影-钢之炼金术师：兄弟会（下）  4BD"},{"$f":"VLOOKUP($D:$D,基础资料!$A:D,4,0)","v":"4"},{"$f":"VLOOKUP($D:$D,基础资料!$A:E,5,0)","v":"套"},{"$f":"VLOOKUP($D:$D,基础资料!$A:F,6,0)","v":"蓝光电影"},null,4,null,{"$f":"SUMIF($D:$D,D149,$L:$L)+SUMIF($D:$D,D149,$J:$J)-SUMIF($D:$D,D149,$K:$K)","v":77},{"$f":"VLOOKUP(D:D,结存!A:J,10,0)","v":77},{"$f":"M149 - N149","v":0}]
["2016-10-28",null,null,594,{"$f":"VLOOKUP($D:$D,基础资料!$A:B,2,0)","v":"07020026"},{"$f":"VLOOKUP($D:$D,基础资料!$A:C,3,0)","v":"蓝影-耐撕侦探1BD+1DVD"},{"$f":"VLOOKUP($D:$D,基础资料!$A:D,4,0)","v":"2"},{"$f":"VLOOKUP($D:$D,基础资料!$A:E,5,0)","v":"套"},{"$f":"VLOOKUP($D:$D,基础资料!$A:F,6,0)","v":"蓝光电影"},10,null,null,{"$f":"SUMIF($D:$D,D150,$L:$L)+SUMIF($D:$D,D150,$J:$J)-SUMIF($D:$D,D150,$K:$K)","v":95},{"$f":"VLOOKUP(D:D,结存!A:J,10,0)","v":95},{"$f":"M150 - N150","v":0}]
["2016-10-28",null,null,594,{"$f":"VLOOKUP($D:$D,基础资料!$A:B,2,0)","v":"07020026"},{"$f":"VLOOKUP($D:$D,基础资料!$A:C,3,0)","v":"蓝影-耐撕侦探1BD+1DVD"},{"$f":"VLOOKUP($D:$D,基础资料!$A:D,4,0)","v":"2"},{"$f":"VLOOKUP($D:$D,基础资料!$A:E,5,0)","v":"套"},{"$f":"VLOOKUP($D:$D,基础资料!$A:F,6,0)","v":"蓝光电影"},null,2,null,{"$f":"SUMIF($D:$D,D151,$L:$L)+SUMIF($D:$D,D151,$J:$J)-SUMIF($D:$D,D151,$K:$K)","v":95},{"$f":"VLOOKUP(D:D,结存!A:J,10,0)","v":95},{"$f":"M151 - N151","v":0}]
["2016-10-28",null,null,690,{"$f":"VLOOKUP($D:$D,基础资料!$A:B,2,0)","v":"0703000344"},{"$f":"VLOOKUP($D:$D,基础资料!$A:C,3,0)","v":"瑞奇与叮当"},{"$f":"VLOOKUP($D:$D,基础资料!$A:D,4,0)","v":"\\"},{"$f":"VLOOKUP($D:$D,基础资料!$A:E,5,0)","v":"套"},{"$f":"VLOOKUP($D:$D,基础资料!$A:F,6,0)","v":"蓝光卡通"},1,null,null,{"$f":"SUMIF($D:$D,D152,$L:$L)+SUMIF($D:$D,D152,$J:$J)-SUMIF($D:$D,D152,$K:$K)","v":96},{"$f":"VLOOKUP(D:D,结存!A:J,10,0)","v":96},{"$f":"M152 - N152","v":0}]
["2016-10-28","1080065",null,690,{"$f":"VLOOKUP($D:$D,基础资料!$A:B,2,0)","v":"0703000344"},{"$f":"VLOOKUP($D:$D,基础资料!$A:C,3,0)","v":"瑞奇与叮当"},{"$f":"VLOOKUP($D:$D,基础资料!$A:D,4,0)","v":"\\"},{"$f":"VLOOKUP($D:$D,基础资料!$A:E,5,0)","v":"套"},{"$f":"VLOOKUP($D:$D,基础资料!$A:F,6,0)","v":"蓝光卡通"},null,1,null,{"$f":"SUMIF($D:$D,D153,$L:$L)+SUMIF($D:$D,D153,$J:$J)-SUMIF($D:$D,D153,$K:$K)","v":96},{"$f":"VLOOKUP(D:D,结存!A:J,10,0)","v":96},{"$f":"M153 - N153","v":0}]
["2016-10-28",null,null,635,{"$f":"VLOOKUP($D:$D,基础资料!$A:B,2,0)","v":"07030011"},{"$f":"VLOOKUP($D:$D,基础资料!$A:C,3,0)","v":"蓝卡-凉宫春日的消失  1BD+2DVD"},{"$f":"VLOOKUP($D:$D,基础资料!$A:D,4,0)","v":"\\"},{"$f":"VLOOKUP($D:$D,基础资料!$A:E,5,0)","v":"套"},{"$f":"VLOOKUP($D:$D,基础资料!$A:F,6,0)","v":"蓝光卡通"},4,null,null,{"$f":"SUMIF($D:$D,D154,$L:$L)+SUMIF($D:$D,D154,$J:$J)-SUMIF($D:$D,D154,$K:$K)","v":95},{"$f":"VLOOKUP(D:D,结存!A:J,10,0)","v":95},{"$f":"M154 - N154","v":0}]
["2016-10-28",null,null,635,{"$f":"VLOOKUP($D:$D,基础资料!$A:B,2,0)","v":"07030011"},{"$f":"VLOOKUP($D:$D,基础资料!$A:C,3,0)","v":"蓝卡-凉宫春日的消失  1BD+2DVD"},{"$f":"VLOOKUP($D:$D,基础资料!$A:D,4,0)","v":"\\"},{"$f":"VLOOKUP($D:$D,基础资料!$A:E,5,0)","v":"套"},{"$f":"VLOOKUP($D:$D,基础资料!$A:F,6,0)","v":"蓝光卡通"},null,4,null,{"$f":"SUMIF($D:$D,D155,$L:$L)+SUMIF($D:$D,D155,$J:$J)-SUMIF($D:$D,D155,$K:$K)","v":95},{"$f":"VLOOKUP(D:D,结存!A:J,10,0)","v":95},{"$f":"M155 - N155","v":0}]
["2016-10-28","1080060",null,526,{"$f":"VLOOKUP($D:$D,基础资料!$A:B,2,0)","v":"07010001"},{"$f":"VLOOKUP($D:$D,基础资料!$A:C,3,0)","v":"蓝剧-地球百子第3季 4BD"},{"$f":"VLOOKUP($D:$D,基础资料!$A:D,4,0)","v":"4"},{"$f":"VLOOKUP($D:$D,基础资料!$A:E,5,0)","v":"套"},{"$f":"VLOOKUP($D:$D,基础资料!$A:F,6,0)","v":"蓝光电视剧"},null,1,null,{"$f":"SUMIF($D:$D,D156,$L:$L)+SUMIF($D:$D,D156,$J:$J)-SUMIF($D:$D,D156,$K:$K)","v":19},{"$f":"VLOOKUP(D:D,结存!A:J,10,0)","v":19},{"$f":"M156 - N156","v":0}]
["2016-10-28","1080060",null,533,{"$f":"VLOOKUP($D:$D,基础资料!$A:B,2,0)","v":"07010006"},{"$f":"VLOOKUP($D:$D,基础资料!$A:C,3,0)","v":"蓝剧-冰血暴第2季  3BD"},{"$f":"VLOOKUP($D:$D,基础资料!$A:D,4,0)","v":"3"},{"$f":"VLOOKUP($D:$D,基础资料!$A:E,5,0)","v":"套"},{"$f":"VLOOKUP($D:$D,基础资料!$A:F,6,0)","v":"蓝光电视剧"},null,2,null,{"$f":"SUMIF($D:$D,D157,$L:$L)+SUMIF($D:$D,D157,$J:$J)-SUMIF($D:$D,D157,$K:$K)","v":89},{"$f":"VLOOKUP(D:D,结存!A:J,10,0)","v":70},{"$f":"M157 - N157","v":19}]
["2016-10-29","1080062",null,611,{"$f":"VLOOKUP($D:$D,基础资料!$A:B,2,0)","v":"07020043"},{"$f":"VLOOKUP($D:$D,基础资料!$A:C,3,0)","v":"蓝影-狼厅 3BD"},{"$f":"VLOOKUP($D:$D,基础资料!$A:D,4,0)","v":"3"},{"$f":"VLOOKUP($D:$D,基础资料!$A:E,5,0)","v":"套"},{"$f":"VLOOKUP($D:$D,基础资料!$A:F,6,0)","v":"蓝光电影"},null,1,null,{"$f":"SUMIF($D:$D,D158,$L:$L)+SUMIF($D:$D,D158,$J:$J)-SUMIF($D:$D,D158,$K:$K)","v":74},{"$f":"VLOOKUP(D:D,结存!A:J,10,0)","v":74},{"$f":"M158 - N158","v":0}]
["2016-10-29","1080061",null,537,{"$f":"VLOOKUP($D:$D,基础资料!$A:B,2,0)","v":"07010011"},{"$f":"VLOOKUP($D:$D,基础资料!$A:C,3,0)","v":"蓝剧-黑色孤儿第2季  2BD"},{"$f":"VLOOKUP($D:$D,基础资料!$A:D,4,0)","v":"2"},{"$f":"VLOOKUP($D:$D,基础资料!$A:E,5,0)","v":"套"},{"$f":"VLOOKUP($D:$D,基础资料!$A:F,6,0)","v":"蓝光电视剧"},null,5,null,{"$f":"SUMIF($D:$D,D159,$L:$L)+SUMIF($D:$D,D159,$J:$J)-SUMIF($D:$D,D159,$K:$K)","v":98},{"$f":"VLOOKUP(D:D,结存!A:J,10,0)","v":79},{"$f":"M159 - N159","v":19}]
["2016-10-29","1080061",null,541,{"$f":"VLOOKUP($D:$D,基础资料!$A:B,2,0)","v":"07010015"},{"$f":"VLOOKUP($D:$D,基础资料!$A:C,3,0)","v":"蓝剧-黑色孤儿第4季  2BD"},{"$f":"VLOOKUP($D:$D,基础资料!$A:D,4,0)","v":"2"},{"$f":"VLOOKUP($D:$D,基础资料!$A:E,5,0)","v":"套"},{"$f":"VLOOKUP($D:$D,基础资料!$A:F,6,0)","v":"蓝光电视剧"},null,5,null,{"$f":"SUMIF($D:$D,D160,$L:$L)+SUMIF($D:$D,D160,$J:$J)-SUMIF($D:$D,D160,$K:$K)","v":63},{"$f":"VLOOKUP(D:D,结存!A:J,10,0)","v":63},{"$f":"M160 - N160","v":0}]
["2016-10-29","10Y0058",null,637,{"$f":"VLOOKUP($D:$D,基础资料!$A:B,2,0)","v":"0704000002"},{"$f":"VLOOKUP($D:$D,基础资料!$A:C,3,0)","v":"S-项目评价"},{"$f":"VLOOKUP($D:$D,基础资料!$A:D,4,0)","v":"\\"},{"$f":"VLOOKUP($D:$D,基础资料!$A:E,5,0)","v":"本"},{"$f":"VLOOKUP($D:$D,基础资料!$A:F,6,0)","v":"书本"},null,80,null,{"$f":"SUMIF($D:$D,D161,$L:$L)+SUMIF($D:$D,D161,$J:$J)-SUMIF($D:$D,D161,$K:$K)","v":1877},{"$f":"VLOOKUP(D:D,结存!A:J,10,0)","v":1877},{"$f":"M161 - N161","v":0}]
["2016-10-29","10Y0058",null,668,{"$f":"VLOOKUP($D:$D,基础资料!$A:B,2,0)","v":"07040026"},{"$f":"VLOOKUP($D:$D,基础资料!$A:C,3,0)","v":"S-团体咨询"},{"$f":"VLOOKUP($D:$D,基础资料!$A:D,4,0)","v":"\\"},{"$f":"VLOOKUP($D:$D,基础资料!$A:E,5,0)","v":"本"},{"$f":"VLOOKUP($D:$D,基础资料!$A:F,6,0)","v":"书本"},null,30,null,{"$f":"SUMIF($D:$D,D162,$L:$L)+SUMIF($D:$D,D162,$J:$J)-SUMIF($D:$D,D162,$K:$K)","v":1473},{"$f":"VLOOKUP(D:D,结存!A:J,10,0)","v":1473},{"$f":"M162 - N162","v":0}]
["2016-10-29","10Y0058",null,638,{"$f":"VLOOKUP($D:$D,基础资料!$A:B,2,0)","v":"0704000003"},{"$f":"VLOOKUP($D:$D,基础资料!$A:C,3,0)","v":"S-人格理论"},{"$f":"VLOOKUP($D:$D,基础资料!$A:D,4,0)","v":"\\"},{"$f":"VLOOKUP($D:$D,基础资料!$A:E,5,0)","v":"本"},{"$f":"VLOOKUP($D:$D,基础资料!$A:F,6,0)","v":"书本"},null,10,null,{"$f":"SUMIF($D:$D,D163,$L:$L)+SUMIF($D:$D,D163,$J:$J)-SUMIF($D:$D,D163,$K:$K)","v":523},{"$f":"VLOOKUP(D:D,结存!A:J,10,0)","v":523},{"$f":"M163 - N163","v":0}]
["2016-10-29","10Y0058",null,640,{"$f":"VLOOKUP($D:$D,基础资料!$A:B,2,0)","v":"0704000035"},{"$f":"VLOOKUP($D:$D,基础资料!$A:C,3,0)","v":"S-商业：一个不断变化的世界"},{"$f":"VLOOKUP($D:$D,基础资料!$A:D,4,0)","v":"\\"},{"$f":"VLOOKUP($D:$D,基础资料!$A:E,5,0)","v":"本"},{"$f":"VLOOKUP($D:$D,基础资料!$A:F,6,0)","v":"书本"},null,25,null,{"$f":"SUMIF($D:$D,D164,$L:$L)+SUMIF($D:$D,D164,$J:$J)-SUMIF($D:$D,D164,$K:$K)","v":474},{"$f":"VLOOKUP(D:D,结存!A:J,10,0)","v":474},{"$f":"M164 - N164","v":0}]
["2016-10-29","10Y0058",null,652,{"$f":"VLOOKUP($D:$D,基础资料!$A:B,2,0)","v":"07040010"},{"$f":"VLOOKUP($D:$D,基础资料!$A:C,3,0)","v":"S-管理技能养成"},{"$f":"VLOOKUP($D:$D,基础资料!$A:D,4,0)","v":"\\"},{"$f":"VLOOKUP($D:$D,基础资料!$A:E,5,0)","v":"本"},{"$f":"VLOOKUP($D:$D,基础资料!$A:F,6,0)","v":"书本"},null,20,null,{"$f":"SUMIF($D:$D,D165,$L:$L)+SUMIF($D:$D,D165,$J:$J)-SUMIF($D:$D,D165,$K:$K)","v":292},{"$f":"VLOOKUP(D:D,结存!A:J,10,0)","v":292},{"$f":"M165 - N165","v":0}]
["2016-10-29","10Y0058",null,636,{"$f":"VLOOKUP($D:$D,基础资料!$A:B,2,0)","v":"0704000001"},{"$f":"VLOOKUP($D:$D,基础资料!$A:C,3,0)","v":"S-内识心理学"},{"$f":"VLOOKUP($D:$D,基础资料!$A:D,4,0)","v":"\\"},{"$f":"VLOOKUP($D:$D,基础资料!$A:E,5,0)","v":"本"},{"$f":"VLOOKUP($D:$D,基础资料!$A:F,6,0)","v":"书本"},null,51,null,{"$f":"SUMIF($D:$D,D166,$L:$L)+SUMIF($D:$D,D166,$J:$J)-SUMIF($D:$D,D166,$K:$K)","v":656},{"$f":"VLOOKUP(D:D,结存!A:J,10,0)","v":656},{"$f":"M166 - N166","v":0}]
["2016-10-29","10Y0058",null,654,{"$f":"VLOOKUP($D:$D,基础资料!$A:B,2,0)","v":"07040012"},{"$f":"VLOOKUP($D:$D,基础资料!$A:C,3,0)","v":"S-实践研究"},{"$f":"VLOOKUP($D:$D,基础资料!$A:D,4,0)","v":"\\"},{"$f":"VLOOKUP($D:$D,基础资料!$A:E,5,0)","v":"本"},{"$f":"VLOOKUP($D:$D,基础资料!$A:F,6,0)","v":"书本"},null,30,null,{"$f":"SUMIF($D:$D,D167,$L:$L)+SUMIF($D:$D,D167,$J:$J)-SUMIF($D:$D,D167,$K:$K)","v":1966},{"$f":"VLOOKUP(D:D,结存!A:J,10,0)","v":1966},{"$f":"M167 - N167","v":0}]
["2016-10-29","10Y0058",null,661,{"$f":"VLOOKUP($D:$D,基础资料!$A:B,2,0)","v":"07040019"},{"$f":"VLOOKUP($D:$D,基础资料!$A:C,3,0)","v":"S-美国药疗保健"},{"$f":"VLOOKUP($D:$D,基础资料!$A:D,4,0)","v":"\\"},{"$f":"VLOOKUP($D:$D,基础资料!$A:E,5,0)","v":"本"},{"$f":"VLOOKUP($D:$D,基础资料!$A:F,6,0)","v":"书本"},null,40,null,{"$f":"SUMIF($D:$D,D168,$L:$L)+SUMIF($D:$D,D168,$J:$J)-SUMIF($D:$D,D168,$K:$K)","v":975},{"$f":"VLOOKUP(D:D,结存!A:J,10,0)","v":975},{"$f":"M168 - N168","v":0}]
["2016-10-29","10Y0058",null,641,{"$f":"VLOOKUP($D:$D,基础资料!$A:B,2,0)","v":"0704000036"},{"$f":"VLOOKUP($D:$D,基础资料!$A:C,3,0)","v":"S-我们的人民"},{"$f":"VLOOKUP($D:$D,基础资料!$A:D,4,0)","v":"\\"},{"$f":"VLOOKUP($D:$D,基础资料!$A:E,5,0)","v":"本"},{"$f":"VLOOKUP($D:$D,基础资料!$A:F,6,0)","v":"书本"},null,25,null,{"$f":"SUMIF($D:$D,D169,$L:$L)+SUMIF($D:$D,D169,$J:$J)-SUMIF($D:$D,D169,$K:$K)","v":2685},{"$f":"VLOOKUP(D:D,结存!A:J,10,0)","v":2685},{"$f":"M169 - N169","v":0}]
["2016-10-29","10Y0058",null,649,{"$f":"VLOOKUP($D:$D,基础资料!$A:B,2,0)","v":"07040007"},{"$f":"VLOOKUP($D:$D,基础资料!$A:C,3,0)","v":"S-行为研究方法"},{"$f":"VLOOKUP($D:$D,基础资料!$A:D,4,0)","v":"\\"},{"$f":"VLOOKUP($D:$D,基础资料!$A:E,5,0)","v":"本"},{"$f":"VLOOKUP($D:$D,基础资料!$A:F,6,0)","v":"书本"},null,20,null,{"$f":"SUMIF($D:$D,D170,$L:$L)+SUMIF($D:$D,D170,$J:$J)-SUMIF($D:$D,D170,$K:$K)","v":4577},{"$f":"VLOOKUP(D:D,结存!A:J,10,0)","v":4577},{"$f":"M170 - N170","v":0}]
["2016-10-29","10Y0058",null,667,{"$f":"VLOOKUP($D:$D,基础资料!$A:B,2,0)","v":"07040025"},{"$f":"VLOOKUP($D:$D,基础资料!$A:C,3,0)","v":"S-临床评估工作簿"},{"$f":"VLOOKUP($D:$D,基础资料!$A:D,4,0)","v":"\\"},{"$f":"VLOOKUP($D:$D,基础资料!$A:E,5,0)","v":"本"},{"$f":"VLOOKUP($D:$D,基础资料!$A:F,6,0)","v":"书本"},null,20,null,{"$f":"SUMIF($D:$D,D171,$L:$L)+SUMIF($D:$D,D171,$J:$J)-SUMIF($D:$D,D171,$K:$K)","v":2338},{"$f":"VLOOKUP(D:D,结存!A:J,10,0)","v":2338},{"$f":"M171 - N171","v":0}]
["2016-10-29","10Y0058",null,645,{"$f":"VLOOKUP($D:$D,基础资料!$A:B,2,0)","v":"07040003"},{"$f":"VLOOKUP($D:$D,基础资料!$A:C,3,0)","v":"S-公共演讲的艺术"},{"$f":"VLOOKUP($D:$D,基础资料!$A:D,4,0)","v":"\\"},{"$f":"VLOOKUP($D:$D,基础资料!$A:E,5,0)","v":"本"},{"$f":"VLOOKUP($D:$D,基础资料!$A:F,6,0)","v":"书本"},null,10,null,{"$f":"SUMIF($D:$D,D172,$L:$L)+SUMIF($D:$D,D172,$J:$J)-SUMIF($D:$D,D172,$K:$K)","v":1403},{"$f":"VLOOKUP(D:D,结存!A:J,10,0)","v":1403},{"$f":"M172 - N172","v":0}]
["2016-10-29","10Y0058",null,650,{"$f":"VLOOKUP($D:$D,基础资料!$A:B,2,0)","v":"07040008"},{"$f":"VLOOKUP($D:$D,基础资料!$A:C,3,0)","v":"S-谈判精要"},{"$f":"VLOOKUP($D:$D,基础资料!$A:D,4,0)","v":"\\"},{"$f":"VLOOKUP($D:$D,基础资料!$A:E,5,0)","v":"本"},{"$f":"VLOOKUP($D:$D,基础资料!$A:F,6,0)","v":"书本"},null,20,null,{"$f":"SUMIF($D:$D,D173,$L:$L)+SUMIF($D:$D,D173,$J:$J)-SUMIF($D:$D,D173,$K:$K)","v":538},{"$f":"VLOOKUP(D:D,结存!A:J,10,0)","v":538},{"$f":"M173 - N173","v":0}]
["2016-10-29","0000000012",null,637,{"$f":"VLOOKUP($D:$D,基础资料!$A:B,2,0)","v":"0704000002"},{"$f":"VLOOKUP($D:$D,基础资料!$A:C,3,0)","v":"S-项目评价"},{"$f":"VLOOKUP($D:$D,基础资料!$A:D,4,0)","v":"\\"},{"$f":"VLOOKUP($D:$D,基础资料!$A:E,5,0)","v":"本"},{"$f":"VLOOKUP($D:$D,基础资料!$A:F,6,0)","v":"书本"},2021,null,null,{"$f":"SUMIF($D:$D,D174,$L:$L)+SUMIF($D:$D,D174,$J:$J)-SUMIF($D:$D,D174,$K:$K)","v":1877},{"$f":"VLOOKUP(D:D,结存!A:J,10,0)","v":1877},{"$f":"M174 - N174","v":0}]
["2016-10-29","10Y0057",null,638,{"$f":"VLOOKUP($D:$D,基础资料!$A:B,2,0)","v":"0704000003"},{"$f":"VLOOKUP($D:$D,基础资料!$A:C,3,0)","v":"S-人格理论"},{"$f":"VLOOKUP($D:$D,基础资料!$A:D,4,0)","v":"\\"},{"$f":"VLOOKUP($D:$D,基础资料!$A:E,5,0)","v":"本"},{"$f":"VLOOKUP($D:$D,基础资料!$A:F,6,0)","v":"书本"},null,50,null,{"$f":"SUMIF($D:$D,D175,$L:$L)+SUMIF($D:$D,D175,$J:$J)-SUMIF($D:$D,D175,$K:$K)","v":523},{"$f":"VLOOKUP(D:D,结存!A:J,10,0)","v":523},{"$f":"M175 - N175","v":0}]
["2016-10-29","10Y0057",null,652,{"$f":"VLOOKUP($D:$D,基础资料!$A:B,2,0)","v":"07040010"},{"$f":"VLOOKUP($D:$D,基础资料!$A:C,3,0)","v":"S-管理技能养成"},{"$f":"VLOOKUP($D:$D,基础资料!$A:D,4,0)","v":"\\"},{"$f":"VLOOKUP($D:$D,基础资料!$A:E,5,0)","v":"本"},{"$f":"VLOOKUP($D:$D,基础资料!$A:F,6,0)","v":"书本"},null,50,null,{"$f":"SUMIF($D:$D,D176,$L:$L)+SUMIF($D:$D,D176,$J:$J)-SUMIF($D:$D,D176,$K:$K)","v":292},{"$f":"VLOOKUP(D:D,结存!A:J,10,0)","v":292},{"$f":"M176 - N176","v":0}]
["2016-10-30",null,null,635,{"$f":"VLOOKUP($D:$D,基础资料!$A:B,2,0)","v":"07030011"},{"$f":"VLOOKUP($D:$D,基础资料!$A:C,3,0)","v":"蓝卡-凉宫春日的消失  1BD+2DVD"},{"$f":"VLOOKUP($D:$D,基础资料!$A:D,4,0)","v":"\\"},{"$f":"VLOOKUP($D:$D,基础资料!$A:E,5,0)","v":"套"},{"$f":"VLOOKUP($D:$D,基础资料!$A:F,6,0)","v":"蓝光卡通"},95,null,null,{"$f":"SUMIF($D:$D,D177,$L:$L)+SUMIF($D:$D,D177,$J:$J)-SUMIF($D:$D,D177,$K:$K)","v":95},{"$f":"VLOOKUP(D:D,结存!A:J,10,0)","v":95},{"$f":"M177 - N177","v":0}]
["2016-10-30",null,null,690,{"$f":"VLOOKUP($D:$D,基础资料!$A:B,2,0)","v":"0703000344"},{"$f":"VLOOKUP($D:$D,基础资料!$A:C,3,0)","v":"瑞奇与叮当"},{"$f":"VLOOKUP($D:$D,基础资料!$A:D,4,0)","v":"\\"},{"$f":"VLOOKUP($D:$D,基础资料!$A:E,5,0)","v":"套"},{"$f":"VLOOKUP($D:$D,基础资料!$A:F,6,0)","v":"蓝光卡通"},97,null,null,{"$f":"SUMIF($D:$D,D178,$L:$L)+SUMIF($D:$D,D178,$J:$J)-SUMIF($D:$D,D178,$K:$K)","v":96},{"$f":"VLOOKUP(D:D,结存!A:J,10,0)","v":96},{"$f":"M178 - N178","v":0}]
["2016-10-30",null,null,568,{"$f":"VLOOKUP($D:$D,基础资料!$A:B,2,0)","v":"0702000032"},{"$f":"VLOOKUP($D:$D,基础资料!$A:C,3,0)","v":"蓝影年轻气盛1BD"},{"$f":"VLOOKUP($D:$D,基础资料!$A:D,4,0)","v":"1"},{"$f":"VLOOKUP($D:$D,基础资料!$A:E,5,0)","v":"套"},{"$f":"VLOOKUP($D:$D,基础资料!$A:F,6,0)","v":"蓝光电影"},98,null,null,{"$f":"SUMIF($D:$D,D179,$L:$L)+SUMIF($D:$D,D179,$J:$J)-SUMIF($D:$D,D179,$K:$K)","v":95},{"$f":"VLOOKUP(D:D,结存!A:J,10,0)","v":95},{"$f":"M179 - N179","v":0}]
["2016-10-30",null,null,689,{"$f":"VLOOKUP($D:$D,基础资料!$A:B,2,0)","v":"0701000349"},{"$f":"VLOOKUP($D:$D,基础资料!$A:C,3,0)","v":"奥丽芙.基特里奇2BD"},{"$f":"VLOOKUP($D:$D,基础资料!$A:D,4,0)","v":"\\"},{"$f":"VLOOKUP($D:$D,基础资料!$A:E,5,0)","v":"套"},{"$f":"VLOOKUP($D:$D,基础资料!$A:F,6,0)","v":"蓝光电视剧"},98,null,null,{"$f":"SUMIF($D:$D,D180,$L:$L)+SUMIF($D:$D,D180,$J:$J)-SUMIF($D:$D,D180,$K:$K)","v":96},{"$f":"VLOOKUP(D:D,结存!A:J,10,0)","v":96},{"$f":"M180 - N180","v":0}]
["2016-10-30",null,null,562,{"$f":"VLOOKUP($D:$D,基础资料!$A:B,2,0)","v":"0702000026"},{"$f":"VLOOKUP($D:$D,基础资料!$A:C,3,0)","v":"蓝影我们都为比尔着盛装1BD"},{"$f":"VLOOKUP($D:$D,基础资料!$A:D,4,0)","v":"1"},{"$f":"VLOOKUP($D:$D,基础资料!$A:E,5,0)","v":"套"},{"$f":"VLOOKUP($D:$D,基础资料!$A:F,6,0)","v":"蓝光电影"},98,null,null,{"$f":"SUMIF($D:$D,D181,$L:$L)+SUMIF($D:$D,D181,$J:$J)-SUMIF($D:$D,D181,$K:$K)","v":98},{"$f":"VLOOKUP(D:D,结存!A:J,10,0)","v":98},{"$f":"M181 - N181","v":0}]
["2016-11-01","0000000042",null,692,{"$f":"VLOOKUP($D:$D,基础资料!$A:B,2,0)","v":"0007050305"},{"$f":"VLOOKUP($D:$D,基础资料!$A:C,3,0)","v":"滚石乐队15CD"},{"$f":"VLOOKUP($D:$D,基础资料!$A:D,4,0)","v":"\\"},{"$f":"VLOOKUP($D:$D,基础资料!$A:E,5,0)","v":"套"},{"$f":"VLOOKUP($D:$D,基础资料!$A:F,6,0)","v":"CD成品"},27,null,null,{"$f":"SUMIF($D:$D,D182,$L:$L)+SUMIF($D:$D,D182,$J:$J)-SUMIF($D:$D,D182,$K:$K)","v":28},{"$f":"VLOOKUP(D:D,结存!A:J,10,0)","v":28},{"$f":"M182 - N182","v":0}]
["2016-11-01","1180074",null,692,{"$f":"VLOOKUP($D:$D,基础资料!$A:B,2,0)","v":"0007050305"},{"$f":"VLOOKUP($D:$D,基础资料!$A:C,3,0)","v":"滚石乐队15CD"},{"$f":"VLOOKUP($D:$D,基础资料!$A:D,4,0)","v":"\\"},{"$f":"VLOOKUP($D:$D,基础资料!$A:E,5,0)","v":"套"},{"$f":"VLOOKUP($D:$D,基础资料!$A:F,6,0)","v":"CD成品"},null,10,null,{"$f":"SUMIF($D:$D,D183,$L:$L)+SUMIF($D:$D,D183,$J:$J)-SUMIF($D:$D,D183,$K:$K)","v":28},{"$f":"VLOOKUP(D:D,结存!A:J,10,0)","v":28},{"$f":"M183 - N183","v":0}]
["2016-11-01","11Y0065",null,692,{"$f":"VLOOKUP($D:$D,基础资料!$A:B,2,0)","v":"0007050305"},{"$f":"VLOOKUP($D:$D,基础资料!$A:C,3,0)","v":"滚石乐队15CD"},{"$f":"VLOOKUP($D:$D,基础资料!$A:D,4,0)","v":"\\"},{"$f":"VLOOKUP($D:$D,基础资料!$A:E,5,0)","v":"套"},{"$f":"VLOOKUP($D:$D,基础资料!$A:F,6,0)","v":"CD成品"},null,2,null,{"$f":"SUMIF($D:$D,D184,$L:$L)+SUMIF($D:$D,D184,$J:$J)-SUMIF($D:$D,D184,$K:$K)","v":28},{"$f":"VLOOKUP(D:D,结存!A:J,10,0)","v":28},{"$f":"M184 - N184","v":0}]
["2016-11-01","1180075",null,692,{"$f":"VLOOKUP($D:$D,基础资料!$A:B,2,0)","v":"0007050305"},{"$f":"VLOOKUP($D:$D,基础资料!$A:C,3,0)","v":"滚石乐队15CD"},{"$f":"VLOOKUP($D:$D,基础资料!$A:D,4,0)","v":"\\"},{"$f":"VLOOKUP($D:$D,基础资料!$A:E,5,0)","v":"套"},{"$f":"VLOOKUP($D:$D,基础资料!$A:F,6,0)","v":"CD成品"},null,15,null,{"$f":"SUMIF($D:$D,D185,$L:$L)+SUMIF($D:$D,D185,$J:$J)-SUMIF($D:$D,D185,$K:$K)","v":28},{"$f":"VLOOKUP(D:D,结存!A:J,10,0)","v":28},{"$f":"M185 - N185","v":0}]
["2016-11-01","11Y0064",null,661,{"$f":"VLOOKUP($D:$D,基础资料!$A:B,2,0)","v":"07040019"},{"$f":"VLOOKUP($D:$D,基础资料!$A:C,3,0)","v":"S-美国药疗保健"},{"$f":"VLOOKUP($D:$D,基础资料!$A:D,4,0)","v":"\\"},{"$f":"VLOOKUP($D:$D,基础资料!$A:E,5,0)","v":"本"},{"$f":"VLOOKUP($D:$D,基础资料!$A:F,6,0)","v":"书本"},null,10,null,{"$f":"SUMIF($D:$D,D186,$L:$L)+SUMIF($D:$D,D186,$J:$J)-SUMIF($D:$D,D186,$K:$K)","v":975},{"$f":"VLOOKUP(D:D,结存!A:J,10,0)","v":975},{"$f":"M186 - N186","v":0}]
["2016-11-01","11Y0064",null,649,{"$f":"VLOOKUP($D:$D,基础资料!$A:B,2,0)","v":"07040007"},{"$f":"VLOOKUP($D:$D,基础资料!$A:C,3,0)","v":"S-行为研究方法"},{"$f":"VLOOKUP($D:$D,基础资料!$A:D,4,0)","v":"\\"},{"$f":"VLOOKUP($D:$D,基础资料!$A:E,5,0)","v":"本"},{"$f":"VLOOKUP($D:$D,基础资料!$A:F,6,0)","v":"书本"},null,20,null,{"$f":"SUMIF($D:$D,D187,$L:$L)+SUMIF($D:$D,D187,$J:$J)-SUMIF($D:$D,D187,$K:$K)","v":4577},{"$f":"VLOOKUP(D:D,结存!A:J,10,0)","v":4577},{"$f":"M187 - N187","v":0}]
["2016-11-01","11Y0064",null,668,{"$f":"VLOOKUP($D:$D,基础资料!$A:B,2,0)","v":"07040026"},{"$f":"VLOOKUP($D:$D,基础资料!$A:C,3,0)","v":"S-团体咨询"},{"$f":"VLOOKUP($D:$D,基础资料!$A:D,4,0)","v":"\\"},{"$f":"VLOOKUP($D:$D,基础资料!$A:E,5,0)","v":"本"},{"$f":"VLOOKUP($D:$D,基础资料!$A:F,6,0)","v":"书本"},null,3,null,{"$f":"SUMIF($D:$D,D188,$L:$L)+SUMIF($D:$D,D188,$J:$J)-SUMIF($D:$D,D188,$K:$K)","v":1473},{"$f":"VLOOKUP(D:D,结存!A:J,10,0)","v":1473},{"$f":"M188 - N188","v":0}]
["2016-11-01","11Y0064",null,637,{"$f":"VLOOKUP($D:$D,基础资料!$A:B,2,0)","v":"0704000002"},{"$f":"VLOOKUP($D:$D,基础资料!$A:C,3,0)","v":"S-项目评价"},{"$f":"VLOOKUP($D:$D,基础资料!$A:D,4,0)","v":"\\"},{"$f":"VLOOKUP($D:$D,基础资料!$A:E,5,0)","v":"本"},{"$f":"VLOOKUP($D:$D,基础资料!$A:F,6,0)","v":"书本"},null,9,null,{"$f":"SUMIF($D:$D,D189,$L:$L)+SUMIF($D:$D,D189,$J:$J)-SUMIF($D:$D,D189,$K:$K)","v":1877},{"$f":"VLOOKUP(D:D,结存!A:J,10,0)","v":1877},{"$f":"M189 - N189","v":0}]
["2016-11-01","11Y0064",null,638,{"$f":"VLOOKUP($D:$D,基础资料!$A:B,2,0)","v":"0704000003"},{"$f":"VLOOKUP($D:$D,基础资料!$A:C,3,0)","v":"S-人格理论"},{"$f":"VLOOKUP($D:$D,基础资料!$A:D,4,0)","v":"\\"},{"$f":"VLOOKUP($D:$D,基础资料!$A:E,5,0)","v":"本"},{"$f":"VLOOKUP($D:$D,基础资料!$A:F,6,0)","v":"书本"},null,3,null,{"$f":"SUMIF($D:$D,D190,$L:$L)+SUMIF($D:$D,D190,$J:$J)-SUMIF($D:$D,D190,$K:$K)","v":523},{"$f":"VLOOKUP(D:D,结存!A:J,10,0)","v":523},{"$f":"M190 - N190","v":0}]
["2016-11-01","11Y0064",null,636,{"$f":"VLOOKUP($D:$D,基础资料!$A:B,2,0)","v":"0704000001"},{"$f":"VLOOKUP($D:$D,基础资料!$A:C,3,0)","v":"S-内识心理学"},{"$f":"VLOOKUP($D:$D,基础资料!$A:D,4,0)","v":"\\"},{"$f":"VLOOKUP($D:$D,基础资料!$A:E,5,0)","v":"本"},{"$f":"VLOOKUP($D:$D,基础资料!$A:F,6,0)","v":"书本"},null,3,null,{"$f":"SUMIF($D:$D,D191,$L:$L)+SUMIF($D:$D,D191,$J:$J)-SUMIF($D:$D,D191,$K:$K)","v":656},{"$f":"VLOOKUP(D:D,结存!A:J,10,0)","v":656},{"$f":"M191 - N191","v":0}]
["2016-11-01","11Y0064",null,651,{"$f":"VLOOKUP($D:$D,基础资料!$A:B,2,0)","v":"07040009"},{"$f":"VLOOKUP($D:$D,基础资料!$A:C,3,0)","v":"S-合作、协商和团队合作"},{"$f":"VLOOKUP($D:$D,基础资料!$A:D,4,0)","v":"\\"},{"$f":"VLOOKUP($D:$D,基础资料!$A:E,5,0)","v":"本"},{"$f":"VLOOKUP($D:$D,基础资料!$A:F,6,0)","v":"书本"},null,3,null,{"$f":"SUMIF($D:$D,D192,$L:$L)+SUMIF($D:$D,D192,$J:$J)-SUMIF($D:$D,D192,$K:$K)","v":311},{"$f":"VLOOKUP(D:D,结存!A:J,10,0)","v":311},{"$f":"M192 - N192","v":0}]
["2016-11-01","11Y0064",null,654,{"$f":"VLOOKUP($D:$D,基础资料!$A:B,2,0)","v":"07040012"},{"$f":"VLOOKUP($D:$D,基础资料!$A:C,3,0)","v":"S-实践研究"},{"$f":"VLOOKUP($D:$D,基础资料!$A:D,4,0)","v":"\\"},{"$f":"VLOOKUP($D:$D,基础资料!$A:E,5,0)","v":"本"},{"$f":"VLOOKUP($D:$D,基础资料!$A:F,6,0)","v":"书本"},null,3,null,{"$f":"SUMIF($D:$D,D193,$L:$L)+SUMIF($D:$D,D193,$J:$J)-SUMIF($D:$D,D193,$K:$K)","v":1966},{"$f":"VLOOKUP(D:D,结存!A:J,10,0)","v":1966},{"$f":"M193 - N193","v":0}]
["2016-11-01","11Y0064",null,655,{"$f":"VLOOKUP($D:$D,基础资料!$A:B,2,0)","v":"07040013"},{"$f":"VLOOKUP($D:$D,基础资料!$A:C,3,0)","v":"S-校园法律"},{"$f":"VLOOKUP($D:$D,基础资料!$A:D,4,0)","v":"\\"},{"$f":"VLOOKUP($D:$D,基础资料!$A:E,5,0)","v":"本"},{"$f":"VLOOKUP($D:$D,基础资料!$A:F,6,0)","v":"书本"},null,20,null,{"$f":"SUMIF($D:$D,D194,$L:$L)+SUMIF($D:$D,D194,$J:$J)-SUMIF($D:$D,D194,$K:$K)","v":698},{"$f":"VLOOKUP(D:D,结存!A:J,10,0)","v":698},{"$f":"M194 - N194","v":0}]
["2016-11-01","11Y0061",null,645,{"$f":"VLOOKUP($D:$D,基础资料!$A:B,2,0)","v":"07040003"},{"$f":"VLOOKUP($D:$D,基础资料!$A:C,3,0)","v":"S-公共演讲的艺术"},{"$f":"VLOOKUP($D:$D,基础资料!$A:D,4,0)","v":"\\"},{"$f":"VLOOKUP($D:$D,基础资料!$A:E,5,0)","v":"本"},{"$f":"VLOOKUP($D:$D,基础资料!$A:F,6,0)","v":"书本"},null,8,null,{"$f":"SUMIF($D:$D,D195,$L:$L)+SUMIF($D:$D,D195,$J:$J)-SUMIF($D:$D,D195,$K:$K)","v":1403},{"$f":"VLOOKUP(D:D,结存!A:J,10,0)","v":1403},{"$f":"M195 - N195","v":0}]
["2016-10-31","1080067",null,532,{"$f":"VLOOKUP($D:$D,基础资料!$A:B,2,0)","v":"07010005"},{"$f":"VLOOKUP($D:$D,基础资料!$A:C,3,0)","v":"蓝剧-我是僵尸第2季  4BD"},{"$f":"VLOOKUP($D:$D,基础资料!$A:D,4,0)","v":"4"},{"$f":"VLOOKUP($D:$D,基础资料!$A:E,5,0)","v":"套"},{"$f":"VLOOKUP($D:$D,基础资料!$A:F,6,0)","v":"蓝光电视剧"},null,5,61,{"$f":"SUMIF($D:$D,D196,$L:$L)+SUMIF($D:$D,D196,$J:$J)-SUMIF($D:$D,D196,$K:$K)","v":55},{"$f":"VLOOKUP(D:D,结存!A:J,10,0)","v":55},{"$f":"M196 - N196","v":0}]
["2016-10-31","10Y0059",null,674,{"$f":"VLOOKUP($D:$D,基础资料!$A:B,2,0)","v":"07040032"},{"$f":"VLOOKUP($D:$D,基础资料!$A:C,3,0)","v":"S-民事诉讼"},{"$f":"VLOOKUP($D:$D,基础资料!$A:D,4,0)","v":"\\"},{"$f":"VLOOKUP($D:$D,基础资料!$A:E,5,0)","v":"本"},{"$f":"VLOOKUP($D:$D,基础资料!$A:F,6,0)","v":"书本"},null,3,null,{"$f":"SUMIF($D:$D,D197,$L:$L)+SUMIF($D:$D,D197,$J:$J)-SUMIF($D:$D,D197,$K:$K)","v":707},{"$f":"VLOOKUP(D:D,结存!A:J,10,0)","v":707},{"$f":"M197 - N197","v":0}]
["2016-10-31","10Y0059",null,642,{"$f":"VLOOKUP($D:$D,基础资料!$A:B,2,0)","v":"07040001"},{"$f":"VLOOKUP($D:$D,基础资料!$A:C,3,0)","v":"S-恐怖故事（3本一套）"},{"$f":"VLOOKUP($D:$D,基础资料!$A:D,4,0)","v":"\\"},{"$f":"VLOOKUP($D:$D,基础资料!$A:E,5,0)","v":"套"},{"$f":"VLOOKUP($D:$D,基础资料!$A:F,6,0)","v":"书本"},null,10,null,{"$f":"SUMIF($D:$D,D198,$L:$L)+SUMIF($D:$D,D198,$J:$J)-SUMIF($D:$D,D198,$K:$K)","v":35},{"$f":"VLOOKUP(D:D,结存!A:J,10,0)","v":35},{"$f":"M198 - N198","v":0}]
["2016-10-31","10Y0059",null,641,{"$f":"VLOOKUP($D:$D,基础资料!$A:B,2,0)","v":"0704000036"},{"$f":"VLOOKUP($D:$D,基础资料!$A:C,3,0)","v":"S-我们的人民"},{"$f":"VLOOKUP($D:$D,基础资料!$A:D,4,0)","v":"\\"},{"$f":"VLOOKUP($D:$D,基础资料!$A:E,5,0)","v":"本"},{"$f":"VLOOKUP($D:$D,基础资料!$A:F,6,0)","v":"书本"},null,2,null,{"$f":"SUMIF($D:$D,D199,$L:$L)+SUMIF($D:$D,D199,$J:$J)-SUMIF($D:$D,D199,$K:$K)","v":2685},{"$f":"VLOOKUP(D:D,结存!A:J,10,0)","v":2685},{"$f":"M199 - N199","v":0}]
["2016-10-31","10Y0059",null,668,{"$f":"VLOOKUP($D:$D,基础资料!$A:B,2,0)","v":"07040026"},{"$f":"VLOOKUP($D:$D,基础资料!$A:C,3,0)","v":"S-团体咨询"},{"$f":"VLOOKUP($D:$D,基础资料!$A:D,4,0)","v":"\\"},{"$f":"VLOOKUP($D:$D,基础资料!$A:E,5,0)","v":"本"},{"$f":"VLOOKUP($D:$D,基础资料!$A:F,6,0)","v":"书本"},null,2,null,{"$f":"SUMIF($D:$D,D200,$L:$L)+SUMIF($D:$D,D200,$J:$J)-SUMIF($D:$D,D200,$K:$K)","v":1473},{"$f":"VLOOKUP(D:D,结存!A:J,10,0)","v":1473},{"$f":"M200 - N200","v":0}]
["2016-10-31","10Y0059",null,661,{"$f":"VLOOKUP($D:$D,基础资料!$A:B,2,0)","v":"07040019"},{"$f":"VLOOKUP($D:$D,基础资料!$A:C,3,0)","v":"S-美国药疗保健"},{"$f":"VLOOKUP($D:$D,基础资料!$A:D,4,0)","v":"\\"},{"$f":"VLOOKUP($D:$D,基础资料!$A:E,5,0)","v":"本"},{"$f":"VLOOKUP($D:$D,基础资料!$A:F,6,0)","v":"书本"},null,1,null,{"$f":"SUMIF($D:$D,D201,$L:$L)+SUMIF($D:$D,D201,$J:$J)-SUMIF($D:$D,D201,$K:$K)","v":975},{"$f":"VLOOKUP(D:D,结存!A:J,10,0)","v":975},{"$f":"M201 - N201","v":0}]
["2016-10-31","0000000040",null,693,{"$f":"VLOOKUP($D:$D,基础资料!$A:B,2,0)","v":"0702000350"},{"$f":"VLOOKUP($D:$D,基础资料!$A:C,3,0)","v":"星际迷航3：超越星辰"},{"$f":"VLOOKUP($D:$D,基础资料!$A:D,4,0)","v":"\\"},{"$f":"VLOOKUP($D:$D,基础资料!$A:E,5,0)","v":"套"},{"$f":"VLOOKUP($D:$D,基础资料!$A:F,6,0)","v":"蓝光电影"},31,null,null,{"$f":"SUMIF($D:$D,D202,$L:$L)+SUMIF($D:$D,D202,$J:$J)-SUMIF($D:$D,D202,$K:$K)","v":17},{"$f":"VLOOKUP(D:D,结存!A:J,10,0)","v":17},{"$f":"M202 - N202","v":0}]
["2016-10-31","0000000038",null,563,{"$f":"VLOOKUP($D:$D,基础资料!$A:B,2,0)","v":"0702000027"},{"$f":"VLOOKUP($D:$D,基础资料!$A:C,3,0)","v":"蓝影攀登梅鲁峰1BD"},{"$f":"VLOOKUP($D:$D,基础资料!$A:D,4,0)","v":"1"},{"$f":"VLOOKUP($D:$D,基础资料!$A:E,5,0)","v":"套"},{"$f":"VLOOKUP($D:$D,基础资料!$A:F,6,0)","v":"蓝光电影"},2,null,null,{"$f":"SUMIF($D:$D,D203,$L:$L)+SUMIF($D:$D,D203,$J:$J)-SUMIF($D:$D,D203,$K:$K)","v":0},{"$f":"VLOOKUP(D:D,结存!A:J,10,0)","v":0},{"$f":"M203 - N203","v":0}]
["2016-10-31","0000000013",null,672,{"$f":"VLOOKUP($D:$D,基础资料!$A:B,2,0)","v":"07040030"},{"$f":"VLOOKUP($D:$D,基础资料!$A:C,3,0)","v":"S-法律写作和分析"},{"$f":"VLOOKUP($D:$D,基础资料!$A:D,4,0)","v":"\\"},{"$f":"VLOOKUP($D:$D,基础资料!$A:E,5,0)","v":"本"},{"$f":"VLOOKUP($D:$D,基础资料!$A:F,6,0)","v":"书本"},1012,null,null,{"$f":"SUMIF($D:$D,D204,$L:$L)+SUMIF($D:$D,D204,$J:$J)-SUMIF($D:$D,D204,$K:$K)","v":712},{"$f":"VLOOKUP(D:D,结存!A:J,10,0)","v":712},{"$f":"M204 - N204","v":0}]
["2016-10-31","1080071",null,693,{"$f":"VLOOKUP($D:$D,基础资料!$A:B,2,0)","v":"0702000350"},{"$f":"VLOOKUP($D:$D,基础资料!$A:C,3,0)","v":"星际迷航3：超越星辰"},{"$f":"VLOOKUP($D:$D,基础资料!$A:D,4,0)","v":"\\"},{"$f":"VLOOKUP($D:$D,基础资料!$A:E,5,0)","v":"套"},{"$f":"VLOOKUP($D:$D,基础资料!$A:F,6,0)","v":"蓝光电影"},null,31,null,{"$f":"SUMIF($D:$D,D205,$L:$L)+SUMIF($D:$D,D205,$J:$J)-SUMIF($D:$D,D205,$K:$K)","v":17},{"$f":"VLOOKUP(D:D,结存!A:J,10,0)","v":17},{"$f":"M205 - N205","v":0}]
["2016-10-31","10Y0060",null,672,{"$f":"VLOOKUP($D:$D,基础资料!$A:B,2,0)","v":"07040030"},{"$f":"VLOOKUP($D:$D,基础资料!$A:C,3,0)","v":"S-法律写作和分析"},{"$f":"VLOOKUP($D:$D,基础资料!$A:D,4,0)","v":"\\"},{"$f":"VLOOKUP($D:$D,基础资料!$A:E,5,0)","v":"本"},{"$f":"VLOOKUP($D:$D,基础资料!$A:F,6,0)","v":"书本"},null,300,null,{"$f":"SUMIF($D:$D,D206,$L:$L)+SUMIF($D:$D,D206,$J:$J)-SUMIF($D:$D,D206,$K:$K)","v":712},{"$f":"VLOOKUP(D:D,结存!A:J,10,0)","v":712},{"$f":"M206 - N206","v":0}]
["2016-10-31","0000000039",null,529,{"$f":"VLOOKUP($D:$D,基础资料!$A:B,2,0)","v":"0701000235"},{"$f":"VLOOKUP($D:$D,基础资料!$A:C,3,0)","v":"蓝剧传教士 第一季3BD"},{"$f":"VLOOKUP($D:$D,基础资料!$A:D,4,0)","v":"3"},{"$f":"VLOOKUP($D:$D,基础资料!$A:E,5,0)","v":"套"},{"$f":"VLOOKUP($D:$D,基础资料!$A:F,6,0)","v":"蓝光电视剧"},4,null,null,{"$f":"SUMIF($D:$D,D207,$L:$L)+SUMIF($D:$D,D207,$J:$J)-SUMIF($D:$D,D207,$K:$K)","v":90},{"$f":"VLOOKUP(D:D,结存!A:J,10,0)","v":90},{"$f":"M207 - N207","v":0}]
["2016-10-31","1080068",null,529,{"$f":"VLOOKUP($D:$D,基础资料!$A:B,2,0)","v":"0701000235"},{"$f":"VLOOKUP($D:$D,基础资料!$A:C,3,0)","v":"蓝剧传教士 第一季3BD"},{"$f":"VLOOKUP($D:$D,基础资料!$A:D,4,0)","v":"3"},{"$f":"VLOOKUP($D:$D,基础资料!$A:E,5,0)","v":"套"},{"$f":"VLOOKUP($D:$D,基础资料!$A:F,6,0)","v":"蓝光电视剧"},null,4,null,{"$f":"SUMIF($D:$D,D208,$L:$L)+SUMIF($D:$D,D208,$J:$J)-SUMIF($D:$D,D208,$K:$K)","v":90},{"$f":"VLOOKUP(D:D,结存!A:J,10,0)","v":90},{"$f":"M208 - N208","v":0}]
["2016-10-31","1080068",null,563,{"$f":"VLOOKUP($D:$D,基础资料!$A:B,2,0)","v":"0702000027"},{"$f":"VLOOKUP($D:$D,基础资料!$A:C,3,0)","v":"蓝影攀登梅鲁峰1BD"},{"$f":"VLOOKUP($D:$D,基础资料!$A:D,4,0)","v":"1"},{"$f":"VLOOKUP($D:$D,基础资料!$A:E,5,0)","v":"套"},{"$f":"VLOOKUP($D:$D,基础资料!$A:F,6,0)","v":"蓝光电影"},null,2,null,{"$f":"SUMIF($D:$D,D209,$L:$L)+SUMIF($D:$D,D209,$J:$J)-SUMIF($D:$D,D209,$K:$K)","v":0},{"$f":"VLOOKUP(D:D,结存!A:J,10,0)","v":0},{"$f":"M209 - N209","v":0}]
["2016-10-31","1080068",null,689,{"$f":"VLOOKUP($D:$D,基础资料!$A:B,2,0)","v":"0701000349"},{"$f":"VLOOKUP($D:$D,基础资料!$A:C,3,0)","v":"奥丽芙.基特里奇2BD"},{"$f":"VLOOKUP($D:$D,基础资料!$A:D,4,0)","v":"\\"},{"$f":"VLOOKUP($D:$D,基础资料!$A:E,5,0)","v":"套"},{"$f":"VLOOKUP($D:$D,基础资料!$A:F,6,0)","v":"蓝光电视剧"},null,2,null,{"$f":"SUMIF($D:$D,D210,$L:$L)+SUMIF($D:$D,D210,$J:$J)-SUMIF($D:$D,D210,$K:$K)","v":96},{"$f":"VLOOKUP(D:D,结存!A:J,10,0)","v":96},{"$f":"M210 - N210","v":0}]
["2016-10-31","1080069",null,568,{"$f":"VLOOKUP($D:$D,基础资料!$A:B,2,0)","v":"0702000032"},{"$f":"VLOOKUP($D:$D,基础资料!$A:C,3,0)","v":"蓝影年轻气盛1BD"},{"$f":"VLOOKUP($D:$D,基础资料!$A:D,4,0)","v":"1"},{"$f":"VLOOKUP($D:$D,基础资料!$A:E,5,0)","v":"套"},{"$f":"VLOOKUP($D:$D,基础资料!$A:F,6,0)","v":"蓝光电影"},null,2,null,{"$f":"SUMIF($D:$D,D211,$L:$L)+SUMIF($D:$D,D211,$J:$J)-SUMIF($D:$D,D211,$K:$K)","v":95},{"$f":"VLOOKUP(D:D,结存!A:J,10,0)","v":95},{"$f":"M211 - N211","v":0}]
["2016-11-01","11Y0063",null,675,{"$f":"VLOOKUP($D:$D,基础资料!$A:B,2,0)","v":"07040033"},{"$f":"VLOOKUP($D:$D,基础资料!$A:C,3,0)","v":"S-机械实践"},{"$f":"VLOOKUP($D:$D,基础资料!$A:D,4,0)","v":"\\"},{"$f":"VLOOKUP($D:$D,基础资料!$A:E,5,0)","v":"本"},{"$f":"VLOOKUP($D:$D,基础资料!$A:F,6,0)","v":"书本"},null,50,null,{"$f":"SUMIF($D:$D,D212,$L:$L)+SUMIF($D:$D,D212,$J:$J)-SUMIF($D:$D,D212,$K:$K)","v":463},{"$f":"VLOOKUP(D:D,结存!A:J,10,0)","v":463},{"$f":"M212 - N212","v":0}]
["2016-11-01","0000000041",null,529,{"$f":"VLOOKUP($D:$D,基础资料!$A:B,2,0)","v":"0701000235"},{"$f":"VLOOKUP($D:$D,基础资料!$A:C,3,0)","v":"蓝剧传教士 第一季3BD"},{"$f":"VLOOKUP($D:$D,基础资料!$A:D,4,0)","v":"3"},{"$f":"VLOOKUP($D:$D,基础资料!$A:E,5,0)","v":"套"},{"$f":"VLOOKUP($D:$D,基础资料!$A:F,6,0)","v":"蓝光电视剧"},2,null,null,{"$f":"SUMIF($D:$D,D213,$L:$L)+SUMIF($D:$D,D213,$J:$J)-SUMIF($D:$D,D213,$K:$K)","v":90},{"$f":"VLOOKUP(D:D,结存!A:J,10,0)","v":90},{"$f":"M213 - N213","v":0}]
["2016-11-01","1180073",null,529,{"$f":"VLOOKUP($D:$D,基础资料!$A:B,2,0)","v":"0701000235"},{"$f":"VLOOKUP($D:$D,基础资料!$A:C,3,0)","v":"蓝剧传教士 第一季3BD"},{"$f":"VLOOKUP($D:$D,基础资料!$A:D,4,0)","v":"3"},{"$f":"VLOOKUP($D:$D,基础资料!$A:E,5,0)","v":"套"},{"$f":"VLOOKUP($D:$D,基础资料!$A:F,6,0)","v":"蓝光电视剧"},null,2,null,{"$f":"SUMIF($D:$D,D214,$L:$L)+SUMIF($D:$D,D214,$J:$J)-SUMIF($D:$D,D214,$K:$K)","v":90},{"$f":"VLOOKUP(D:D,结存!A:J,10,0)","v":90},{"$f":"M214 - N214","v":0}]
["2016-11-01","1180072",null,541,{"$f":"VLOOKUP($D:$D,基础资料!$A:B,2,0)","v":"07010015"},{"$f":"VLOOKUP($D:$D,基础资料!$A:C,3,0)","v":"蓝剧-黑色孤儿第4季  2BD"},{"$f":"VLOOKUP($D:$D,基础资料!$A:D,4,0)","v":"2"},{"$f":"VLOOKUP($D:$D,基础资料!$A:E,5,0)","v":"套"},{"$f":"VLOOKUP($D:$D,基础资料!$A:F,6,0)","v":"蓝光电视剧"},null,5,null,{"$f":"SUMIF($D:$D,D215,$L:$L)+SUMIF($D:$D,D215,$J:$J)-SUMIF($D:$D,D215,$K:$K)","v":63},{"$f":"VLOOKUP(D:D,结存!A:J,10,0)","v":63},{"$f":"M215 - N215","v":0}]
["2016-11-01","11Y0062",null,676,{"$f":"VLOOKUP($D:$D,基础资料!$A:B,2,0)","v":"07040034"},{"$f":"VLOOKUP($D:$D,基础资料!$A:C,3,0)","v":"S-程序员考试"},{"$f":"VLOOKUP($D:$D,基础资料!$A:D,4,0)","v":"\\"},{"$f":"VLOOKUP($D:$D,基础资料!$A:E,5,0)","v":"本"},{"$f":"VLOOKUP($D:$D,基础资料!$A:F,6,0)","v":"书本"},null,10,null,{"$f":"SUMIF($D:$D,D216,$L:$L)+SUMIF($D:$D,D216,$J:$J)-SUMIF($D:$D,D216,$K:$K)","v":1412},{"$f":"VLOOKUP(D:D,结存!A:J,10,0)","v":1412},{"$f":"M216 - N216","v":0}]
["2016-11-01","11Y0062",null,645,{"$f":"VLOOKUP($D:$D,基础资料!$A:B,2,0)","v":"07040003"},{"$f":"VLOOKUP($D:$D,基础资料!$A:C,3,0)","v":"S-公共演讲的艺术"},{"$f":"VLOOKUP($D:$D,基础资料!$A:D,4,0)","v":"\\"},{"$f":"VLOOKUP($D:$D,基础资料!$A:E,5,0)","v":"本"},{"$f":"VLOOKUP($D:$D,基础资料!$A:F,6,0)","v":"书本"},null,10,null,{"$f":"SUMIF($D:$D,D217,$L:$L)+SUMIF($D:$D,D217,$J:$J)-SUMIF($D:$D,D217,$K:$K)","v":1403},{"$f":"VLOOKUP(D:D,结存!A:J,10,0)","v":1403},{"$f":"M217 - N217","v":0}]
["2016-11-01","11Y0062",null,656,{"$f":"VLOOKUP($D:$D,基础资料!$A:B,2,0)","v":"07040014"},{"$f":"VLOOKUP($D:$D,基础资料!$A:C,3,0)","v":"S-伦理护理"},{"$f":"VLOOKUP($D:$D,基础资料!$A:D,4,0)","v":"\\"},{"$f":"VLOOKUP($D:$D,基础资料!$A:E,5,0)","v":"本"},{"$f":"VLOOKUP($D:$D,基础资料!$A:F,6,0)","v":"书本"},null,10,null,{"$f":"SUMIF($D:$D,D218,$L:$L)+SUMIF($D:$D,D218,$J:$J)-SUMIF($D:$D,D218,$K:$K)","v":956},{"$f":"VLOOKUP(D:D,结存!A:J,10,0)","v":956},{"$f":"M218 - N218","v":0}]
["2016-11-01","11Y0062",null,662,{"$f":"VLOOKUP($D:$D,基础资料!$A:B,2,0)","v":"07040020"},{"$f":"VLOOKUP($D:$D,基础资料!$A:C,3,0)","v":"S-硕士考试指南"},{"$f":"VLOOKUP($D:$D,基础资料!$A:D,4,0)","v":"\\"},{"$f":"VLOOKUP($D:$D,基础资料!$A:E,5,0)","v":"本"},{"$f":"VLOOKUP($D:$D,基础资料!$A:F,6,0)","v":"书本"},null,10,null,{"$f":"SUMIF($D:$D,D219,$L:$L)+SUMIF($D:$D,D219,$J:$J)-SUMIF($D:$D,D219,$K:$K)","v":2104},{"$f":"VLOOKUP(D:D,结存!A:J,10,0)","v":2104},{"$f":"M219 - N219","v":0}]
["2016-11-01","11Y0062",null,655,{"$f":"VLOOKUP($D:$D,基础资料!$A:B,2,0)","v":"07040013"},{"$f":"VLOOKUP($D:$D,基础资料!$A:C,3,0)","v":"S-校园法律"},{"$f":"VLOOKUP($D:$D,基础资料!$A:D,4,0)","v":"\\"},{"$f":"VLOOKUP($D:$D,基础资料!$A:E,5,0)","v":"本"},{"$f":"VLOOKUP($D:$D,基础资料!$A:F,6,0)","v":"书本"},null,40,null,{"$f":"SUMIF($D:$D,D220,$L:$L)+SUMIF($D:$D,D220,$J:$J)-SUMIF($D:$D,D220,$K:$K)","v":698},{"$f":"VLOOKUP(D:D,结存!A:J,10,0)","v":698},{"$f":"M220 - N220","v":0}]
["2016-11-01","11Y0062",null,642,{"$f":"VLOOKUP($D:$D,基础资料!$A:B,2,0)","v":"07040001"},{"$f":"VLOOKUP($D:$D,基础资料!$A:C,3,0)","v":"S-恐怖故事（3本一套）"},{"$f":"VLOOKUP($D:$D,基础资料!$A:D,4,0)","v":"\\"},{"$f":"VLOOKUP($D:$D,基础资料!$A:E,5,0)","v":"套"},{"$f":"VLOOKUP($D:$D,基础资料!$A:F,6,0)","v":"书本"},null,46,null,{"$f":"SUMIF($D:$D,D221,$L:$L)+SUMIF($D:$D,D221,$J:$J)-SUMIF($D:$D,D221,$K:$K)","v":35},{"$f":"VLOOKUP(D:D,结存!A:J,10,0)","v":35},{"$f":"M221 - N221","v":0}]
["2016-11-01","11Y0062",null,650,{"$f":"VLOOKUP($D:$D,基础资料!$A:B,2,0)","v":"07040008"},{"$f":"VLOOKUP($D:$D,基础资料!$A:C,3,0)","v":"S-谈判精要"},{"$f":"VLOOKUP($D:$D,基础资料!$A:D,4,0)","v":"\\"},{"$f":"VLOOKUP($D:$D,基础资料!$A:E,5,0)","v":"本"},{"$f":"VLOOKUP($D:$D,基础资料!$A:F,6,0)","v":"书本"},null,10,null,{"$f":"SUMIF($D:$D,D222,$L:$L)+SUMIF($D:$D,D222,$J:$J)-SUMIF($D:$D,D222,$K:$K)","v":538},{"$f":"VLOOKUP(D:D,结存!A:J,10,0)","v":538},{"$f":"M222 - N222","v":0}]
["2016-11-01","11Y0062",null,669,{"$f":"VLOOKUP($D:$D,基础资料!$A:B,2,0)","v":"07040027"},{"$f":"VLOOKUP($D:$D,基础资料!$A:C,3,0)","v":"S-小屁孩日记（9本一套）"},{"$f":"VLOOKUP($D:$D,基础资料!$A:D,4,0)","v":"\\"},{"$f":"VLOOKUP($D:$D,基础资料!$A:E,5,0)","v":"套"},{"$f":"VLOOKUP($D:$D,基础资料!$A:F,6,0)","v":"书本"},null,5,null,{"$f":"SUMIF($D:$D,D223,$L:$L)+SUMIF($D:$D,D223,$J:$J)-SUMIF($D:$D,D223,$K:$K)","v":958},{"$f":"VLOOKUP(D:D,结存!A:J,10,0)","v":958},{"$f":"M223 - N223","v":0}]
["2016-11-01","11Y0061",null,639,{"$f":"VLOOKUP($D:$D,基础资料!$A:B,2,0)","v":"0704000004"},{"$f":"VLOOKUP($D:$D,基础资料!$A:C,3,0)","v":"S-电器查询"},{"$f":"VLOOKUP($D:$D,基础资料!$A:D,4,0)","v":"\\"},{"$f":"VLOOKUP($D:$D,基础资料!$A:E,5,0)","v":"本"},{"$f":"VLOOKUP($D:$D,基础资料!$A:F,6,0)","v":"书本"},null,50,null,{"$f":"SUMIF($D:$D,D224,$L:$L)+SUMIF($D:$D,D224,$J:$J)-SUMIF($D:$D,D224,$K:$K)","v":223},{"$f":"VLOOKUP(D:D,结存!A:J,10,0)","v":223},{"$f":"M224 - N224","v":0}]
["2016-11-02","1180080",null,692,{"$f":"VLOOKUP($D:$D,基础资料!$A:B,2,0)","v":"0007050305"},{"$f":"VLOOKUP($D:$D,基础资料!$A:C,3,0)","v":"滚石乐队15CD"},{"$f":"VLOOKUP($D:$D,基础资料!$A:D,4,0)","v":"\\"},{"$f":"VLOOKUP($D:$D,基础资料!$A:E,5,0)","v":"套"},{"$f":"VLOOKUP($D:$D,基础资料!$A:F,6,0)","v":"CD成品"},null,15,null,{"$f":"SUMIF($D:$D,D225,$L:$L)+SUMIF($D:$D,D225,$J:$J)-SUMIF($D:$D,D225,$K:$K)","v":28},{"$f":"VLOOKUP(D:D,结存!A:J,10,0)","v":28},{"$f":"M225 - N225","v":0}]
["2016-11-02","1180083",null,693,{"$f":"VLOOKUP($D:$D,基础资料!$A:B,2,0)","v":"0702000350"},{"$f":"VLOOKUP($D:$D,基础资料!$A:C,3,0)","v":"星际迷航3：超越星辰"},{"$f":"VLOOKUP($D:$D,基础资料!$A:D,4,0)","v":"\\"},{"$f":"VLOOKUP($D:$D,基础资料!$A:E,5,0)","v":"套"},{"$f":"VLOOKUP($D:$D,基础资料!$A:F,6,0)","v":"蓝光电影"},null,50,null,{"$f":"SUMIF($D:$D,D226,$L:$L)+SUMIF($D:$D,D226,$J:$J)-SUMIF($D:$D,D226,$K:$K)","v":17},{"$f":"VLOOKUP(D:D,结存!A:J,10,0)","v":17},{"$f":"M226 - N226","v":0}]
["2016-11-02","1180086",null,607,{"$f":"VLOOKUP($D:$D,基础资料!$A:B,2,0)","v":"07020039"},{"$f":"VLOOKUP($D:$D,基础资料!$A:C,3,0)","v":"蓝影-钢之炼金术师：兄弟会（上）  4BD"},{"$f":"VLOOKUP($D:$D,基础资料!$A:D,4,0)","v":"4"},{"$f":"VLOOKUP($D:$D,基础资料!$A:E,5,0)","v":"套"},{"$f":"VLOOKUP($D:$D,基础资料!$A:F,6,0)","v":"蓝光电影"},null,3,null,{"$f":"SUMIF($D:$D,D227,$L:$L)+SUMIF($D:$D,D227,$J:$J)-SUMIF($D:$D,D227,$K:$K)","v":72},{"$f":"VLOOKUP(D:D,结存!A:J,10,0)","v":72},{"$f":"M227 - N227","v":0}]
["2016-11-02","1180086",null,633,{"$f":"VLOOKUP($D:$D,基础资料!$A:B,2,0)","v":"07030009"},{"$f":"VLOOKUP($D:$D,基础资料!$A:C,3,0)","v":"蓝卡-星际牛仔  4BD"},{"$f":"VLOOKUP($D:$D,基础资料!$A:D,4,0)","v":"4"},{"$f":"VLOOKUP($D:$D,基础资料!$A:E,5,0)","v":"套"},{"$f":"VLOOKUP($D:$D,基础资料!$A:F,6,0)","v":"蓝光卡通"},null,1,null,{"$f":"SUMIF($D:$D,D228,$L:$L)+SUMIF($D:$D,D228,$J:$J)-SUMIF($D:$D,D228,$K:$K)","v":9},{"$f":"VLOOKUP(D:D,结存!A:J,10,0)","v":9},{"$f":"M228 - N228","v":0}]
["2016-11-02","1180077",null,692,{"$f":"VLOOKUP($D:$D,基础资料!$A:B,2,0)","v":"0007050305"},{"$f":"VLOOKUP($D:$D,基础资料!$A:C,3,0)","v":"滚石乐队15CD"},{"$f":"VLOOKUP($D:$D,基础资料!$A:D,4,0)","v":"\\"},{"$f":"VLOOKUP($D:$D,基础资料!$A:E,5,0)","v":"套"},{"$f":"VLOOKUP($D:$D,基础资料!$A:F,6,0)","v":"CD成品"},null,3,null,{"$f":"SUMIF($D:$D,D229,$L:$L)+SUMIF($D:$D,D229,$J:$J)-SUMIF($D:$D,D229,$K:$K)","v":28},{"$f":"VLOOKUP(D:D,结存!A:J,10,0)","v":28},{"$f":"M229 - N229","v":0}]
["2016-11-02","11Y0066",null,652,{"$f":"VLOOKUP($D:$D,基础资料!$A:B,2,0)","v":"07040010"},{"$f":"VLOOKUP($D:$D,基础资料!$A:C,3,0)","v":"S-管理技能养成"},{"$f":"VLOOKUP($D:$D,基础资料!$A:D,4,0)","v":"\\"},{"$f":"VLOOKUP($D:$D,基础资料!$A:E,5,0)","v":"本"},{"$f":"VLOOKUP($D:$D,基础资料!$A:F,6,0)","v":"书本"},null,50,null,{"$f":"SUMIF($D:$D,D230,$L:$L)+SUMIF($D:$D,D230,$J:$J)-SUMIF($D:$D,D230,$K:$K)","v":292},{"$f":"VLOOKUP(D:D,结存!A:J,10,0)","v":292},{"$f":"M230 - N230","v":0}]
["2016-11-02","0000000007",null,639,{"$f":"VLOOKUP($D:$D,基础资料!$A:B,2,0)","v":"0704000004"},{"$f":"VLOOKUP($D:$D,基础资料!$A:C,3,0)","v":"S-电器查询"},{"$f":"VLOOKUP($D:$D,基础资料!$A:D,4,0)","v":"\\"},{"$f":"VLOOKUP($D:$D,基础资料!$A:E,5,0)","v":"本"},{"$f":"VLOOKUP($D:$D,基础资料!$A:F,6,0)","v":"书本"},50,null,null,{"$f":"SUMIF($D:$D,D231,$L:$L)+SUMIF($D:$D,D231,$J:$J)-SUMIF($D:$D,D231,$K:$K)","v":223},{"$f":"VLOOKUP(D:D,结存!A:J,10,0)","v":223},{"$f":"M231 - N231","v":0}]
["2016-11-02","0000000007",null,668,{"$f":"VLOOKUP($D:$D,基础资料!$A:B,2,0)","v":"07040026"},{"$f":"VLOOKUP($D:$D,基础资料!$A:C,3,0)","v":"S-团体咨询"},{"$f":"VLOOKUP($D:$D,基础资料!$A:D,4,0)","v":"\\"},{"$f":"VLOOKUP($D:$D,基础资料!$A:E,5,0)","v":"本"},{"$f":"VLOOKUP($D:$D,基础资料!$A:F,6,0)","v":"书本"},1,null,null,{"$f":"SUMIF($D:$D,D232,$L:$L)+SUMIF($D:$D,D232,$J:$J)-SUMIF($D:$D,D232,$K:$K)","v":1473},{"$f":"VLOOKUP(D:D,结存!A:J,10,0)","v":1473},{"$f":"M232 - N232","v":0}]
["2016-11-02","0000000044",null,594,{"$f":"VLOOKUP($D:$D,基础资料!$A:B,2,0)","v":"07020026"},{"$f":"VLOOKUP($D:$D,基础资料!$A:C,3,0)","v":"蓝影-耐撕侦探1BD+1DVD"},{"$f":"VLOOKUP($D:$D,基础资料!$A:D,4,0)","v":"2"},{"$f":"VLOOKUP($D:$D,基础资料!$A:E,5,0)","v":"套"},{"$f":"VLOOKUP($D:$D,基础资料!$A:F,6,0)","v":"蓝光电影"},87,null,null,{"$f":"SUMIF($D:$D,D233,$L:$L)+SUMIF($D:$D,D233,$J:$J)-SUMIF($D:$D,D233,$K:$K)","v":95},{"$f":"VLOOKUP(D:D,结存!A:J,10,0)","v":95},{"$f":"M233 - N233","v":0}]
["2016-11-03","1180088",null,692,{"$f":"VLOOKUP($D:$D,基础资料!$A:B,2,0)","v":"0007050305"},{"$f":"VLOOKUP($D:$D,基础资料!$A:C,3,0)","v":"滚石乐队15CD"},{"$f":"VLOOKUP($D:$D,基础资料!$A:D,4,0)","v":"\\"},{"$f":"VLOOKUP($D:$D,基础资料!$A:E,5,0)","v":"套"},{"$f":"VLOOKUP($D:$D,基础资料!$A:F,6,0)","v":"CD成品"},null,10,null,{"$f":"SUMIF($D:$D,D234,$L:$L)+SUMIF($D:$D,D234,$J:$J)-SUMIF($D:$D,D234,$K:$K)","v":28},{"$f":"VLOOKUP(D:D,结存!A:J,10,0)","v":28},{"$f":"M234 - N234","v":0}]
["2016-11-02","0000000043",null,692,{"$f":"VLOOKUP($D:$D,基础资料!$A:B,2,0)","v":"0007050305"},{"$f":"VLOOKUP($D:$D,基础资料!$A:C,3,0)","v":"滚石乐队15CD"},{"$f":"VLOOKUP($D:$D,基础资料!$A:D,4,0)","v":"\\"},{"$f":"VLOOKUP($D:$D,基础资料!$A:E,5,0)","v":"套"},{"$f":"VLOOKUP($D:$D,基础资料!$A:F,6,0)","v":"CD成品"},23,null,null,{"$f":"SUMIF($D:$D,D235,$L:$L)+SUMIF($D:$D,D235,$J:$J)-SUMIF($D:$D,D235,$K:$K)","v":28},{"$f":"VLOOKUP(D:D,结存!A:J,10,0)","v":28},{"$f":"M235 - N235","v":0}]
["2016-11-03","11Y0070",null,639,{"$f":"VLOOKUP($D:$D,基础资料!$A:B,2,0)","v":"0704000004"},{"$f":"VLOOKUP($D:$D,基础资料!$A:C,3,0)","v":"S-电器查询"},{"$f":"VLOOKUP($D:$D,基础资料!$A:D,4,0)","v":"\\"},{"$f":"VLOOKUP($D:$D,基础资料!$A:E,5,0)","v":"本"},{"$f":"VLOOKUP($D:$D,基础资料!$A:F,6,0)","v":"书本"},null,20,null,{"$f":"SUMIF($D:$D,D236,$L:$L)+SUMIF($D:$D,D236,$J:$J)-SUMIF($D:$D,D236,$K:$K)","v":223},{"$f":"VLOOKUP(D:D,结存!A:J,10,0)","v":223},{"$f":"M236 - N236","v":0}]
["2016-11-03","11Y0070",null,636,{"$f":"VLOOKUP($D:$D,基础资料!$A:B,2,0)","v":"0704000001"},{"$f":"VLOOKUP($D:$D,基础资料!$A:C,3,0)","v":"S-内识心理学"},{"$f":"VLOOKUP($D:$D,基础资料!$A:D,4,0)","v":"\\"},{"$f":"VLOOKUP($D:$D,基础资料!$A:E,5,0)","v":"本"},{"$f":"VLOOKUP($D:$D,基础资料!$A:F,6,0)","v":"书本"},null,105,null,{"$f":"SUMIF($D:$D,D237,$L:$L)+SUMIF($D:$D,D237,$J:$J)-SUMIF($D:$D,D237,$K:$K)","v":656},{"$f":"VLOOKUP(D:D,结存!A:J,10,0)","v":656},{"$f":"M237 - N237","v":0}]
["2016-11-03","11Y0070",null,637,{"$f":"VLOOKUP($D:$D,基础资料!$A:B,2,0)","v":"0704000002"},{"$f":"VLOOKUP($D:$D,基础资料!$A:C,3,0)","v":"S-项目评价"},{"$f":"VLOOKUP($D:$D,基础资料!$A:D,4,0)","v":"\\"},{"$f":"VLOOKUP($D:$D,基础资料!$A:E,5,0)","v":"本"},{"$f":"VLOOKUP($D:$D,基础资料!$A:F,6,0)","v":"书本"},null,25,null,{"$f":"SUMIF($D:$D,D238,$L:$L)+SUMIF($D:$D,D238,$J:$J)-SUMIF($D:$D,D238,$K:$K)","v":1877},{"$f":"VLOOKUP(D:D,结存!A:J,10,0)","v":1877},{"$f":"M238 - N238","v":0}]
["2016-11-03","11Y0070",null,668,{"$f":"VLOOKUP($D:$D,基础资料!$A:B,2,0)","v":"07040026"},{"$f":"VLOOKUP($D:$D,基础资料!$A:C,3,0)","v":"S-团体咨询"},{"$f":"VLOOKUP($D:$D,基础资料!$A:D,4,0)","v":"\\"},{"$f":"VLOOKUP($D:$D,基础资料!$A:E,5,0)","v":"本"},{"$f":"VLOOKUP($D:$D,基础资料!$A:F,6,0)","v":"书本"},null,5,null,{"$f":"SUMIF($D:$D,D239,$L:$L)+SUMIF($D:$D,D239,$J:$J)-SUMIF($D:$D,D239,$K:$K)","v":1473},{"$f":"VLOOKUP(D:D,结存!A:J,10,0)","v":1473},{"$f":"M239 - N239","v":0}]
["2016-11-03","11Y0070",null,641,{"$f":"VLOOKUP($D:$D,基础资料!$A:B,2,0)","v":"0704000036"},{"$f":"VLOOKUP($D:$D,基础资料!$A:C,3,0)","v":"S-我们的人民"},{"$f":"VLOOKUP($D:$D,基础资料!$A:D,4,0)","v":"\\"},{"$f":"VLOOKUP($D:$D,基础资料!$A:E,5,0)","v":"本"},{"$f":"VLOOKUP($D:$D,基础资料!$A:F,6,0)","v":"书本"},null,5,null,{"$f":"SUMIF($D:$D,D240,$L:$L)+SUMIF($D:$D,D240,$J:$J)-SUMIF($D:$D,D240,$K:$K)","v":2685},{"$f":"VLOOKUP(D:D,结存!A:J,10,0)","v":2685},{"$f":"M240 - N240","v":0}]
["2016-11-03","11Y0070",null,648,{"$f":"VLOOKUP($D:$D,基础资料!$A:B,2,0)","v":"07040006"},{"$f":"VLOOKUP($D:$D,基础资料!$A:C,3,0)","v":"S-大众传媒法"},{"$f":"VLOOKUP($D:$D,基础资料!$A:D,4,0)","v":"\\"},{"$f":"VLOOKUP($D:$D,基础资料!$A:E,5,0)","v":"本"},{"$f":"VLOOKUP($D:$D,基础资料!$A:F,6,0)","v":"书本"},null,15,null,{"$f":"SUMIF($D:$D,D241,$L:$L)+SUMIF($D:$D,D241,$J:$J)-SUMIF($D:$D,D241,$K:$K)","v":19},{"$f":"VLOOKUP(D:D,结存!A:J,10,0)","v":19},{"$f":"M241 - N241","v":0}]
["2016-11-03","11Y0070",null,650,{"$f":"VLOOKUP($D:$D,基础资料!$A:B,2,0)","v":"07040008"},{"$f":"VLOOKUP($D:$D,基础资料!$A:C,3,0)","v":"S-谈判精要"},{"$f":"VLOOKUP($D:$D,基础资料!$A:D,4,0)","v":"\\"},{"$f":"VLOOKUP($D:$D,基础资料!$A:E,5,0)","v":"本"},{"$f":"VLOOKUP($D:$D,基础资料!$A:F,6,0)","v":"书本"},null,100,null,{"$f":"SUMIF($D:$D,D242,$L:$L)+SUMIF($D:$D,D242,$J:$J)-SUMIF($D:$D,D242,$K:$K)","v":538},{"$f":"VLOOKUP(D:D,结存!A:J,10,0)","v":538},{"$f":"M242 - N242","v":0}]
["2016-11-03","00000000049",null,692,{"$f":"VLOOKUP($D:$D,基础资料!$A:B,2,0)","v":"0007050305"},{"$f":"VLOOKUP($D:$D,基础资料!$A:C,3,0)","v":"滚石乐队15CD"},{"$f":"VLOOKUP($D:$D,基础资料!$A:D,4,0)","v":"\\"},{"$f":"VLOOKUP($D:$D,基础资料!$A:E,5,0)","v":"套"},{"$f":"VLOOKUP($D:$D,基础资料!$A:F,6,0)","v":"CD成品"},48,null,null,{"$f":"SUMIF($D:$D,D243,$L:$L)+SUMIF($D:$D,D243,$J:$J)-SUMIF($D:$D,D243,$K:$K)","v":28},{"$f":"VLOOKUP(D:D,结存!A:J,10,0)","v":28},{"$f":"M243 - N243","v":0}]
["2016-11-03","1180089",null,692,{"$f":"VLOOKUP($D:$D,基础资料!$A:B,2,0)","v":"0007050305"},{"$f":"VLOOKUP($D:$D,基础资料!$A:C,3,0)","v":"滚石乐队15CD"},{"$f":"VLOOKUP($D:$D,基础资料!$A:D,4,0)","v":"\\"},{"$f":"VLOOKUP($D:$D,基础资料!$A:E,5,0)","v":"套"},{"$f":"VLOOKUP($D:$D,基础资料!$A:F,6,0)","v":"CD成品"},null,6,null,{"$f":"SUMIF($D:$D,D244,$L:$L)+SUMIF($D:$D,D244,$J:$J)-SUMIF($D:$D,D244,$K:$K)","v":28},{"$f":"VLOOKUP(D:D,结存!A:J,10,0)","v":28},{"$f":"M244 - N244","v":0}]
["2016-11-03","1180089",null,573,{"$f":"VLOOKUP($D:$D,基础资料!$A:B,2,0)","v":"07020005"},{"$f":"VLOOKUP($D:$D,基础资料!$A:C,3,0)","v":"蓝影-猫王:是这样的:特别版  1BD+1DVD"},{"$f":"VLOOKUP($D:$D,基础资料!$A:D,4,0)","v":"2"},{"$f":"VLOOKUP($D:$D,基础资料!$A:E,5,0)","v":"套"},{"$f":"VLOOKUP($D:$D,基础资料!$A:F,6,0)","v":"蓝光电影"},null,15,null,{"$f":"SUMIF($D:$D,D245,$L:$L)+SUMIF($D:$D,D245,$J:$J)-SUMIF($D:$D,D245,$K:$K)","v":69},{"$f":"VLOOKUP(D:D,结存!A:J,10,0)","v":69},{"$f":"M245 - N245","v":0}]
["2016-11-03","1180087",null,532,{"$f":"VLOOKUP($D:$D,基础资料!$A:B,2,0)","v":"07010005"},{"$f":"VLOOKUP($D:$D,基础资料!$A:C,3,0)","v":"蓝剧-我是僵尸第2季  4BD"},{"$f":"VLOOKUP($D:$D,基础资料!$A:D,4,0)","v":"4"},{"$f":"VLOOKUP($D:$D,基础资料!$A:E,5,0)","v":"套"},{"$f":"VLOOKUP($D:$D,基础资料!$A:F,6,0)","v":"蓝光电视剧"},null,1,null,{"$f":"SUMIF($D:$D,D246,$L:$L)+SUMIF($D:$D,D246,$J:$J)-SUMIF($D:$D,D246,$K:$K)","v":55},{"$f":"VLOOKUP(D:D,结存!A:J,10,0)","v":55},{"$f":"M246 - N246","v":0}]
["2016-11-03","1180087",null,526,{"$f":"VLOOKUP($D:$D,基础资料!$A:B,2,0)","v":"07010001"},{"$f":"VLOOKUP($D:$D,基础资料!$A:C,3,0)","v":"蓝剧-地球百子第3季 4BD"},{"$f":"VLOOKUP($D:$D,基础资料!$A:D,4,0)","v":"4"},{"$f":"VLOOKUP($D:$D,基础资料!$A:E,5,0)","v":"套"},{"$f":"VLOOKUP($D:$D,基础资料!$A:F,6,0)","v":"蓝光电视剧"},null,1,null,{"$f":"SUMIF($D:$D,D247,$L:$L)+SUMIF($D:$D,D247,$J:$J)-SUMIF($D:$D,D247,$K:$K)","v":19},{"$f":"VLOOKUP(D:D,结存!A:J,10,0)","v":19},{"$f":"M247 - N247","v":0}]
["2016-11-03","1180087",null,693,{"$f":"VLOOKUP($D:$D,基础资料!$A:B,2,0)","v":"0702000350"},{"$f":"VLOOKUP($D:$D,基础资料!$A:C,3,0)","v":"星际迷航3：超越星辰"},{"$f":"VLOOKUP($D:$D,基础资料!$A:D,4,0)","v":"\\"},{"$f":"VLOOKUP($D:$D,基础资料!$A:E,5,0)","v":"套"},{"$f":"VLOOKUP($D:$D,基础资料!$A:F,6,0)","v":"蓝光电影"},null,1,null,{"$f":"SUMIF($D:$D,D248,$L:$L)+SUMIF($D:$D,D248,$J:$J)-SUMIF($D:$D,D248,$K:$K)","v":17},{"$f":"VLOOKUP(D:D,结存!A:J,10,0)","v":17},{"$f":"M248 - N248","v":0}]
["2016-11-03","1180087",null,568,{"$f":"VLOOKUP($D:$D,基础资料!$A:B,2,0)","v":"0702000032"},{"$f":"VLOOKUP($D:$D,基础资料!$A:C,3,0)","v":"蓝影年轻气盛1BD"},{"$f":"VLOOKUP($D:$D,基础资料!$A:D,4,0)","v":"1"},{"$f":"VLOOKUP($D:$D,基础资料!$A:E,5,0)","v":"套"},{"$f":"VLOOKUP($D:$D,基础资料!$A:F,6,0)","v":"蓝光电影"},null,1,null,{"$f":"SUMIF($D:$D,D249,$L:$L)+SUMIF($D:$D,D249,$J:$J)-SUMIF($D:$D,D249,$K:$K)","v":95},{"$f":"VLOOKUP(D:D,结存!A:J,10,0)","v":95},{"$f":"M249 - N249","v":0}]
["2016-11-03","1180087",null,690,{"$f":"VLOOKUP($D:$D,基础资料!$A:B,2,0)","v":"0703000344"},{"$f":"VLOOKUP($D:$D,基础资料!$A:C,3,0)","v":"瑞奇与叮当"},{"$f":"VLOOKUP($D:$D,基础资料!$A:D,4,0)","v":"\\"},{"$f":"VLOOKUP($D:$D,基础资料!$A:E,5,0)","v":"套"},{"$f":"VLOOKUP($D:$D,基础资料!$A:F,6,0)","v":"蓝光卡通"},null,1,null,{"$f":"SUMIF($D:$D,D250,$L:$L)+SUMIF($D:$D,D250,$J:$J)-SUMIF($D:$D,D250,$K:$K)","v":96},{"$f":"VLOOKUP(D:D,结存!A:J,10,0)","v":96},{"$f":"M250 - N250","v":0}]
["2016-11-03","1180087",null,633,{"$f":"VLOOKUP($D:$D,基础资料!$A:B,2,0)","v":"07030009"},{"$f":"VLOOKUP($D:$D,基础资料!$A:C,3,0)","v":"蓝卡-星际牛仔  4BD"},{"$f":"VLOOKUP($D:$D,基础资料!$A:D,4,0)","v":"4"},{"$f":"VLOOKUP($D:$D,基础资料!$A:E,5,0)","v":"套"},{"$f":"VLOOKUP($D:$D,基础资料!$A:F,6,0)","v":"蓝光卡通"},null,1,null,{"$f":"SUMIF($D:$D,D251,$L:$L)+SUMIF($D:$D,D251,$J:$J)-SUMIF($D:$D,D251,$K:$K)","v":9},{"$f":"VLOOKUP(D:D,结存!A:J,10,0)","v":9},{"$f":"M251 - N251","v":0}]
["2016-11-03","11Y0068",null,658,{"$f":"VLOOKUP($D:$D,基础资料!$A:B,2,0)","v":"07040016"},{"$f":"VLOOKUP($D:$D,基础资料!$A:C,3,0)","v":"S-四十项心理学的研究 821"},{"$f":"VLOOKUP($D:$D,基础资料!$A:D,4,0)","v":"\\"},{"$f":"VLOOKUP($D:$D,基础资料!$A:E,5,0)","v":"本"},{"$f":"VLOOKUP($D:$D,基础资料!$A:F,6,0)","v":"书本"},null,250,null,{"$f":"SUMIF($D:$D,D252,$L:$L)+SUMIF($D:$D,D252,$J:$J)-SUMIF($D:$D,D252,$K:$K)","v":1},{"$f":"VLOOKUP(D:D,结存!A:J,10,0)","v":1},{"$f":"M252 - N252","v":0}]
["2016-11-03","0000000048",null,529,{"$f":"VLOOKUP($D:$D,基础资料!$A:B,2,0)","v":"0701000235"},{"$f":"VLOOKUP($D:$D,基础资料!$A:C,3,0)","v":"蓝剧传教士 第一季3BD"},{"$f":"VLOOKUP($D:$D,基础资料!$A:D,4,0)","v":"3"},{"$f":"VLOOKUP($D:$D,基础资料!$A:E,5,0)","v":"套"},{"$f":"VLOOKUP($D:$D,基础资料!$A:F,6,0)","v":"蓝光电视剧"},90,null,null,{"$f":"SUMIF($D:$D,D253,$L:$L)+SUMIF($D:$D,D253,$J:$J)-SUMIF($D:$D,D253,$K:$K)","v":90},{"$f":"VLOOKUP(D:D,结存!A:J,10,0)","v":90},{"$f":"M253 - N253","v":0}]
["2016-11-03","0000000047",null,693,{"$f":"VLOOKUP($D:$D,基础资料!$A:B,2,0)","v":"0702000350"},{"$f":"VLOOKUP($D:$D,基础资料!$A:C,3,0)","v":"星际迷航3：超越星辰"},{"$f":"VLOOKUP($D:$D,基础资料!$A:D,4,0)","v":"\\"},{"$f":"VLOOKUP($D:$D,基础资料!$A:E,5,0)","v":"套"},{"$f":"VLOOKUP($D:$D,基础资料!$A:F,6,0)","v":"蓝光电影"},68,null,null,{"$f":"SUMIF($D:$D,D254,$L:$L)+SUMIF($D:$D,D254,$J:$J)-SUMIF($D:$D,D254,$K:$K)","v":17},{"$f":"VLOOKUP(D:D,结存!A:J,10,0)","v":17},{"$f":"M254 - N254","v":0}]
["2016-11-03","0000000047",null,621,{"$f":"VLOOKUP($D:$D,基础资料!$A:B,2,0)","v":"0703000024"},{"$f":"VLOOKUP($D:$D,基础资料!$A:C,3,0)","v":"蓝卡愤怒的小鸟1BD+1DVD"},{"$f":"VLOOKUP($D:$D,基础资料!$A:D,4,0)","v":"1BD+1DVD"},{"$f":"VLOOKUP($D:$D,基础资料!$A:E,5,0)","v":"套"},{"$f":"VLOOKUP($D:$D,基础资料!$A:F,6,0)","v":"蓝光卡通"},10,null,null,{"$f":"SUMIF($D:$D,D255,$L:$L)+SUMIF($D:$D,D255,$J:$J)-SUMIF($D:$D,D255,$K:$K)","v":485},{"$f":"VLOOKUP(D:D,结存!A:J,10,0)","v":485},{"$f":"M255 - N255","v":0}]
["2016-11-03","1180090",null,692,{"$f":"VLOOKUP($D:$D,基础资料!$A:B,2,0)","v":"0007050305"},{"$f":"VLOOKUP($D:$D,基础资料!$A:C,3,0)","v":"滚石乐队15CD"},{"$f":"VLOOKUP($D:$D,基础资料!$A:D,4,0)","v":"\\"},{"$f":"VLOOKUP($D:$D,基础资料!$A:E,5,0)","v":"套"},{"$f":"VLOOKUP($D:$D,基础资料!$A:F,6,0)","v":"CD成品"},null,4,null,{"$f":"SUMIF($D:$D,D256,$L:$L)+SUMIF($D:$D,D256,$J:$J)-SUMIF($D:$D,D256,$K:$K)","v":28},{"$f":"VLOOKUP(D:D,结存!A:J,10,0)","v":28},{"$f":"M256 - N256","v":0}]
["2016-11-04","1180092",null,692,{"$f":"VLOOKUP($D:$D,基础资料!$A:B,2,0)","v":"0007050305"},{"$f":"VLOOKUP($D:$D,基础资料!$A:C,3,0)","v":"滚石乐队15CD"},{"$f":"VLOOKUP($D:$D,基础资料!$A:D,4,0)","v":"\\"},{"$f":"VLOOKUP($D:$D,基础资料!$A:E,5,0)","v":"套"},{"$f":"VLOOKUP($D:$D,基础资料!$A:F,6,0)","v":"CD成品"},null,5,null,{"$f":"SUMIF($D:$D,D257,$L:$L)+SUMIF($D:$D,D257,$J:$J)-SUMIF($D:$D,D257,$K:$K)","v":28},{"$f":"VLOOKUP(D:D,结存!A:J,10,0)","v":28},{"$f":"M257 - N257","v":0}]
["2016-11-04","1180094",null,22,{"$f":"VLOOKUP($D:$D,基础资料!$A:B,2,0)","v":"0007050246"},{"$f":"VLOOKUP($D:$D,基础资料!$A:C,3,0)","v":"猫王这是它的方式（旧版)2CD"},{"$f":"VLOOKUP($D:$D,基础资料!$A:D,4,0)","v":"\\"},{"$f":"VLOOKUP($D:$D,基础资料!$A:E,5,0)","v":"套"},{"$f":"VLOOKUP($D:$D,基础资料!$A:F,6,0)","v":"CD成品"},null,4,null,{"$f":"SUMIF($D:$D,D258,$L:$L)+SUMIF($D:$D,D258,$J:$J)-SUMIF($D:$D,D258,$K:$K)","v":11},{"$f":"VLOOKUP(D:D,结存!A:J,10,0)","v":11},{"$f":"M258 - N258","v":0}]
["2016-11-04","1180094",null,694,{"$f":"VLOOKUP($D:$D,基础资料!$A:B,2,0)","v":"0701000355"},{"$f":"VLOOKUP($D:$D,基础资料!$A:C,3,0)","v":"贝茨旅馆第四季2BD"},{"$f":"VLOOKUP($D:$D,基础资料!$A:D,4,0)","v":"\\"},{"$f":"VLOOKUP($D:$D,基础资料!$A:E,5,0)","v":"本"},{"$f":"VLOOKUP($D:$D,基础资料!$A:F,6,0)","v":"蓝光电影"},null,10,null,{"$f":"SUMIF($D:$D,D259,$L:$L)+SUMIF($D:$D,D259,$J:$J)-SUMIF($D:$D,D259,$K:$K)","v":0},{"$f":"VLOOKUP(D:D,结存!A:J,10,0)","v":0},{"$f":"M259 - N259","v":0}]
["2016-11-04","1180094",null,584,{"$f":"VLOOKUP($D:$D,基础资料!$A:B,2,0)","v":"07020016"},{"$f":"VLOOKUP($D:$D,基础资料!$A:C,3,0)","v":"蓝影-X战警：金刚狼  6BD"},{"$f":"VLOOKUP($D:$D,基础资料!$A:D,4,0)","v":"6"},{"$f":"VLOOKUP($D:$D,基础资料!$A:E,5,0)","v":"套"},{"$f":"VLOOKUP($D:$D,基础资料!$A:F,6,0)","v":"蓝光电影"},null,10,null,{"$f":"SUMIF($D:$D,D260,$L:$L)+SUMIF($D:$D,D260,$J:$J)-SUMIF($D:$D,D260,$K:$K)","v":0},{"$f":"VLOOKUP(D:D,结存!A:J,10,0)","v":0},{"$f":"M260 - N260","v":0}]
["2016-11-04","0000000051",null,22,{"$f":"VLOOKUP($D:$D,基础资料!$A:B,2,0)","v":"0007050246"},{"$f":"VLOOKUP($D:$D,基础资料!$A:C,3,0)","v":"猫王这是它的方式（旧版)2CD"},{"$f":"VLOOKUP($D:$D,基础资料!$A:D,4,0)","v":"\\"},{"$f":"VLOOKUP($D:$D,基础资料!$A:E,5,0)","v":"套"},{"$f":"VLOOKUP($D:$D,基础资料!$A:F,6,0)","v":"CD成品"},20,null,null,{"$f":"SUMIF($D:$D,D261,$L:$L)+SUMIF($D:$D,D261,$J:$J)-SUMIF($D:$D,D261,$K:$K)","v":11},{"$f":"VLOOKUP(D:D,结存!A:J,10,0)","v":11},{"$f":"M261 - N261","v":0}]
["2016-11-04","0000000051",null,694,{"$f":"VLOOKUP($D:$D,基础资料!$A:B,2,0)","v":"0701000355"},{"$f":"VLOOKUP($D:$D,基础资料!$A:C,3,0)","v":"贝茨旅馆第四季2BD"},{"$f":"VLOOKUP($D:$D,基础资料!$A:D,4,0)","v":"\\"},{"$f":"VLOOKUP($D:$D,基础资料!$A:E,5,0)","v":"本"},{"$f":"VLOOKUP($D:$D,基础资料!$A:F,6,0)","v":"蓝光电影"},20,null,null,{"$f":"SUMIF($D:$D,D262,$L:$L)+SUMIF($D:$D,D262,$J:$J)-SUMIF($D:$D,D262,$K:$K)","v":0},{"$f":"VLOOKUP(D:D,结存!A:J,10,0)","v":0},{"$f":"M262 - N262","v":0}]
["2016-11-04","0000000051",null,584,{"$f":"VLOOKUP($D:$D,基础资料!$A:B,2,0)","v":"07020016"},{"$f":"VLOOKUP($D:$D,基础资料!$A:C,3,0)","v":"蓝影-X战警：金刚狼  6BD"},{"$f":"VLOOKUP($D:$D,基础资料!$A:D,4,0)","v":"6"},{"$f":"VLOOKUP($D:$D,基础资料!$A:E,5,0)","v":"套"},{"$f":"VLOOKUP($D:$D,基础资料!$A:F,6,0)","v":"蓝光电影"},10,null,null,{"$f":"SUMIF($D:$D,D263,$L:$L)+SUMIF($D:$D,D263,$J:$J)-SUMIF($D:$D,D263,$K:$K)","v":0},{"$f":"VLOOKUP(D:D,结存!A:J,10,0)","v":0},{"$f":"M263 - N263","v":0}]
["2016-11-04","0000000014",null,695,{"$f":"VLOOKUP($D:$D,基础资料!$A:B,2,0)","v":"0704000366"},{"$f":"VLOOKUP($D:$D,基础资料!$A:C,3,0)","v":"课程指南"},{"$f":"VLOOKUP($D:$D,基础资料!$A:D,4,0)","v":"\\"},{"$f":"VLOOKUP($D:$D,基础资料!$A:E,5,0)","v":"本"},{"$f":"VLOOKUP($D:$D,基础资料!$A:F,6,0)","v":"书本"},600,null,null,{"$f":"SUMIF($D:$D,D264,$L:$L)+SUMIF($D:$D,D264,$J:$J)-SUMIF($D:$D,D264,$K:$K)","v":560},{"$f":"VLOOKUP(D:D,结存!A:J,10,0)","v":560},{"$f":"M264 - N264","v":0}]
["2016-11-04","1180093",null,621,{"$f":"VLOOKUP($D:$D,基础资料!$A:B,2,0)","v":"0703000024"},{"$f":"VLOOKUP($D:$D,基础资料!$A:C,3,0)","v":"蓝卡愤怒的小鸟1BD+1DVD"},{"$f":"VLOOKUP($D:$D,基础资料!$A:D,4,0)","v":"1BD+1DVD"},{"$f":"VLOOKUP($D:$D,基础资料!$A:E,5,0)","v":"套"},{"$f":"VLOOKUP($D:$D,基础资料!$A:F,6,0)","v":"蓝光卡通"},null,6,null,{"$f":"SUMIF($D:$D,D265,$L:$L)+SUMIF($D:$D,D265,$J:$J)-SUMIF($D:$D,D265,$K:$K)","v":485},{"$f":"VLOOKUP(D:D,结存!A:J,10,0)","v":485},{"$f":"M265 - N265","v":0}]
["2016-11-04","1180093",null,694,{"$f":"VLOOKUP($D:$D,基础资料!$A:B,2,0)","v":"0701000355"},{"$f":"VLOOKUP($D:$D,基础资料!$A:C,3,0)","v":"贝茨旅馆第四季2BD"},{"$f":"VLOOKUP($D:$D,基础资料!$A:D,4,0)","v":"\\"},{"$f":"VLOOKUP($D:$D,基础资料!$A:E,5,0)","v":"本"},{"$f":"VLOOKUP($D:$D,基础资料!$A:F,6,0)","v":"蓝光电影"},null,10,null,{"$f":"SUMIF($D:$D,D266,$L:$L)+SUMIF($D:$D,D266,$J:$J)-SUMIF($D:$D,D266,$K:$K)","v":0},{"$f":"VLOOKUP(D:D,结存!A:J,10,0)","v":0},{"$f":"M266 - N266","v":0}]
["2016-11-04","11Y0071",null,662,{"$f":"VLOOKUP($D:$D,基础资料!$A:B,2,0)","v":"07040020"},{"$f":"VLOOKUP($D:$D,基础资料!$A:C,3,0)","v":"S-硕士考试指南"},{"$f":"VLOOKUP($D:$D,基础资料!$A:D,4,0)","v":"\\"},{"$f":"VLOOKUP($D:$D,基础资料!$A:E,5,0)","v":"本"},{"$f":"VLOOKUP($D:$D,基础资料!$A:F,6,0)","v":"书本"},null,30,null,{"$f":"SUMIF($D:$D,D267,$L:$L)+SUMIF($D:$D,D267,$J:$J)-SUMIF($D:$D,D267,$K:$K)","v":2104},{"$f":"VLOOKUP(D:D,结存!A:J,10,0)","v":2104},{"$f":"M267 - N267","v":0}]
["2016-11-05","11Y0073",null,695,{"$f":"VLOOKUP($D:$D,基础资料!$A:B,2,0)","v":"0704000366"},{"$f":"VLOOKUP($D:$D,基础资料!$A:C,3,0)","v":"课程指南"},{"$f":"VLOOKUP($D:$D,基础资料!$A:D,4,0)","v":"\\"},{"$f":"VLOOKUP($D:$D,基础资料!$A:E,5,0)","v":"本"},{"$f":"VLOOKUP($D:$D,基础资料!$A:F,6,0)","v":"书本"},null,20,null,{"$f":"SUMIF($D:$D,D268,$L:$L)+SUMIF($D:$D,D268,$J:$J)-SUMIF($D:$D,D268,$K:$K)","v":560},{"$f":"VLOOKUP(D:D,结存!A:J,10,0)","v":560},{"$f":"M268 - N268","v":0}]
["2016-11-05","11Y0073",null,696,{"$f":"VLOOKUP($D:$D,基础资料!$A:B,2,0)","v":"0704000368"},{"$f":"VLOOKUP($D:$D,基础资料!$A:C,3,0)","v":"国际业务：全球化的挑战"},{"$f":"VLOOKUP($D:$D,基础资料!$A:D,4,0)","v":"\\"},{"$f":"VLOOKUP($D:$D,基础资料!$A:E,5,0)","v":"本"},{"$f":"VLOOKUP($D:$D,基础资料!$A:F,6,0)","v":"书本"},null,20,null,{"$f":"SUMIF($D:$D,D269,$L:$L)+SUMIF($D:$D,D269,$J:$J)-SUMIF($D:$D,D269,$K:$K)","v":32},{"$f":"VLOOKUP(D:D,结存!A:J,10,0)","v":32},{"$f":"M269 - N269","v":0}]
["2016-11-05","11Y0073",null,695,{"$f":"VLOOKUP($D:$D,基础资料!$A:B,2,0)","v":"0704000366"},{"$f":"VLOOKUP($D:$D,基础资料!$A:C,3,0)","v":"课程指南"},{"$f":"VLOOKUP($D:$D,基础资料!$A:D,4,0)","v":"\\"},{"$f":"VLOOKUP($D:$D,基础资料!$A:E,5,0)","v":"本"},{"$f":"VLOOKUP($D:$D,基础资料!$A:F,6,0)","v":"书本"},null,20,null,{"$f":"SUMIF($D:$D,D270,$L:$L)+SUMIF($D:$D,D270,$J:$J)-SUMIF($D:$D,D270,$K:$K)","v":560},{"$f":"VLOOKUP(D:D,结存!A:J,10,0)","v":560},{"$f":"M270 - N270","v":0}]
["2016-11-05","11Y0073",null,696,{"$f":"VLOOKUP($D:$D,基础资料!$A:B,2,0)","v":"0704000368"},{"$f":"VLOOKUP($D:$D,基础资料!$A:C,3,0)","v":"国际业务：全球化的挑战"},{"$f":"VLOOKUP($D:$D,基础资料!$A:D,4,0)","v":"\\"},{"$f":"VLOOKUP($D:$D,基础资料!$A:E,5,0)","v":"本"},{"$f":"VLOOKUP($D:$D,基础资料!$A:F,6,0)","v":"书本"},null,20,null,{"$f":"SUMIF($D:$D,D271,$L:$L)+SUMIF($D:$D,D271,$J:$J)-SUMIF($D:$D,D271,$K:$K)","v":32},{"$f":"VLOOKUP(D:D,结存!A:J,10,0)","v":32},{"$f":"M271 - N271","v":0}]
["2016-11-05","11Y0073",null,636,{"$f":"VLOOKUP($D:$D,基础资料!$A:B,2,0)","v":"0704000001"},{"$f":"VLOOKUP($D:$D,基础资料!$A:C,3,0)","v":"S-内识心理学"},{"$f":"VLOOKUP($D:$D,基础资料!$A:D,4,0)","v":"\\"},{"$f":"VLOOKUP($D:$D,基础资料!$A:E,5,0)","v":"本"},{"$f":"VLOOKUP($D:$D,基础资料!$A:F,6,0)","v":"书本"},null,100,null,{"$f":"SUMIF($D:$D,D272,$L:$L)+SUMIF($D:$D,D272,$J:$J)-SUMIF($D:$D,D272,$K:$K)","v":656},{"$f":"VLOOKUP(D:D,结存!A:J,10,0)","v":656},{"$f":"M272 - N272","v":0}]
["2016-11-05","11Y0073",null,640,{"$f":"VLOOKUP($D:$D,基础资料!$A:B,2,0)","v":"0704000035"},{"$f":"VLOOKUP($D:$D,基础资料!$A:C,3,0)","v":"S-商业：一个不断变化的世界"},{"$f":"VLOOKUP($D:$D,基础资料!$A:D,4,0)","v":"\\"},{"$f":"VLOOKUP($D:$D,基础资料!$A:E,5,0)","v":"本"},{"$f":"VLOOKUP($D:$D,基础资料!$A:F,6,0)","v":"书本"},null,5,null,{"$f":"SUMIF($D:$D,D273,$L:$L)+SUMIF($D:$D,D273,$J:$J)-SUMIF($D:$D,D273,$K:$K)","v":474},{"$f":"VLOOKUP(D:D,结存!A:J,10,0)","v":474},{"$f":"M273 - N273","v":0}]
["2016-11-05","11Y0072",null,645,{"$f":"VLOOKUP($D:$D,基础资料!$A:B,2,0)","v":"07040003"},{"$f":"VLOOKUP($D:$D,基础资料!$A:C,3,0)","v":"S-公共演讲的艺术"},{"$f":"VLOOKUP($D:$D,基础资料!$A:D,4,0)","v":"\\"},{"$f":"VLOOKUP($D:$D,基础资料!$A:E,5,0)","v":"本"},{"$f":"VLOOKUP($D:$D,基础资料!$A:F,6,0)","v":"书本"},null,20,null,{"$f":"SUMIF($D:$D,D274,$L:$L)+SUMIF($D:$D,D274,$J:$J)-SUMIF($D:$D,D274,$K:$K)","v":1403},{"$f":"VLOOKUP(D:D,结存!A:J,10,0)","v":1403},{"$f":"M274 - N274","v":0}]
["2016-11-05","11Y0072",null,637,{"$f":"VLOOKUP($D:$D,基础资料!$A:B,2,0)","v":"0704000002"},{"$f":"VLOOKUP($D:$D,基础资料!$A:C,3,0)","v":"S-项目评价"},{"$f":"VLOOKUP($D:$D,基础资料!$A:D,4,0)","v":"\\"},{"$f":"VLOOKUP($D:$D,基础资料!$A:E,5,0)","v":"本"},{"$f":"VLOOKUP($D:$D,基础资料!$A:F,6,0)","v":"书本"},null,10,null,{"$f":"SUMIF($D:$D,D275,$L:$L)+SUMIF($D:$D,D275,$J:$J)-SUMIF($D:$D,D275,$K:$K)","v":1877},{"$f":"VLOOKUP(D:D,结存!A:J,10,0)","v":1877},{"$f":"M275 - N275","v":0}]
["2016-11-05","11Y0072",null,668,{"$f":"VLOOKUP($D:$D,基础资料!$A:B,2,0)","v":"07040026"},{"$f":"VLOOKUP($D:$D,基础资料!$A:C,3,0)","v":"S-团体咨询"},{"$f":"VLOOKUP($D:$D,基础资料!$A:D,4,0)","v":"\\"},{"$f":"VLOOKUP($D:$D,基础资料!$A:E,5,0)","v":"本"},{"$f":"VLOOKUP($D:$D,基础资料!$A:F,6,0)","v":"书本"},null,10,null,{"$f":"SUMIF($D:$D,D276,$L:$L)+SUMIF($D:$D,D276,$J:$J)-SUMIF($D:$D,D276,$K:$K)","v":1473},{"$f":"VLOOKUP(D:D,结存!A:J,10,0)","v":1473},{"$f":"M276 - N276","v":0}]
["2016-11-05","11Y0072",null,641,{"$f":"VLOOKUP($D:$D,基础资料!$A:B,2,0)","v":"0704000036"},{"$f":"VLOOKUP($D:$D,基础资料!$A:C,3,0)","v":"S-我们的人民"},{"$f":"VLOOKUP($D:$D,基础资料!$A:D,4,0)","v":"\\"},{"$f":"VLOOKUP($D:$D,基础资料!$A:E,5,0)","v":"本"},{"$f":"VLOOKUP($D:$D,基础资料!$A:F,6,0)","v":"书本"},null,10,null,{"$f":"SUMIF($D:$D,D277,$L:$L)+SUMIF($D:$D,D277,$J:$J)-SUMIF($D:$D,D277,$K:$K)","v":2685},{"$f":"VLOOKUP(D:D,结存!A:J,10,0)","v":2685},{"$f":"M277 - N277","v":0}]
["2016-11-05","11Y0072",null,655,{"$f":"VLOOKUP($D:$D,基础资料!$A:B,2,0)","v":"07040013"},{"$f":"VLOOKUP($D:$D,基础资料!$A:C,3,0)","v":"S-校园法律"},{"$f":"VLOOKUP($D:$D,基础资料!$A:D,4,0)","v":"\\"},{"$f":"VLOOKUP($D:$D,基础资料!$A:E,5,0)","v":"本"},{"$f":"VLOOKUP($D:$D,基础资料!$A:F,6,0)","v":"书本"},null,10,null,{"$f":"SUMIF($D:$D,D278,$L:$L)+SUMIF($D:$D,D278,$J:$J)-SUMIF($D:$D,D278,$K:$K)","v":698},{"$f":"VLOOKUP(D:D,结存!A:J,10,0)","v":698},{"$f":"M278 - N278","v":0}]
["2016-11-05","11Y0072",null,637,{"$f":"VLOOKUP($D:$D,基础资料!$A:B,2,0)","v":"0704000002"},{"$f":"VLOOKUP($D:$D,基础资料!$A:C,3,0)","v":"S-项目评价"},{"$f":"VLOOKUP($D:$D,基础资料!$A:D,4,0)","v":"\\"},{"$f":"VLOOKUP($D:$D,基础资料!$A:E,5,0)","v":"本"},{"$f":"VLOOKUP($D:$D,基础资料!$A:F,6,0)","v":"书本"},null,50,null,{"$f":"SUMIF($D:$D,D279,$L:$L)+SUMIF($D:$D,D279,$J:$J)-SUMIF($D:$D,D279,$K:$K)","v":1877},{"$f":"VLOOKUP(D:D,结存!A:J,10,0)","v":1877},{"$f":"M279 - N279","v":0}]
["2016-11-05","0000000015",null,696,{"$f":"VLOOKUP($D:$D,基础资料!$A:B,2,0)","v":"0704000368"},{"$f":"VLOOKUP($D:$D,基础资料!$A:C,3,0)","v":"国际业务：全球化的挑战"},{"$f":"VLOOKUP($D:$D,基础资料!$A:D,4,0)","v":"\\"},{"$f":"VLOOKUP($D:$D,基础资料!$A:E,5,0)","v":"本"},{"$f":"VLOOKUP($D:$D,基础资料!$A:F,6,0)","v":"书本"},72,null,null,{"$f":"SUMIF($D:$D,D280,$L:$L)+SUMIF($D:$D,D280,$J:$J)-SUMIF($D:$D,D280,$K:$K)","v":32},{"$f":"VLOOKUP(D:D,结存!A:J,10,0)","v":32},{"$f":"M280 - N280","v":0}]
["2016-11-05","11Y0072",null,621,{"$f":"VLOOKUP($D:$D,基础资料!$A:B,2,0)","v":"0703000024"},{"$f":"VLOOKUP($D:$D,基础资料!$A:C,3,0)","v":"蓝卡愤怒的小鸟1BD+1DVD"},{"$f":"VLOOKUP($D:$D,基础资料!$A:D,4,0)","v":"1BD+1DVD"},{"$f":"VLOOKUP($D:$D,基础资料!$A:E,5,0)","v":"套"},{"$f":"VLOOKUP($D:$D,基础资料!$A:F,6,0)","v":"蓝光卡通"},500,null,null,{"$f":"SUMIF($D:$D,D281,$L:$L)+SUMIF($D:$D,D281,$J:$J)-SUMIF($D:$D,D281,$K:$K)","v":485},{"$f":"VLOOKUP(D:D,结存!A:J,10,0)","v":485},{"$f":"M281 - N281","v":0}]
["2016-11-05","11Y0072",null,621,{"$f":"VLOOKUP($D:$D,基础资料!$A:B,2,0)","v":"0703000024"},{"$f":"VLOOKUP($D:$D,基础资料!$A:C,3,0)","v":"蓝卡愤怒的小鸟1BD+1DVD"},{"$f":"VLOOKUP($D:$D,基础资料!$A:D,4,0)","v":"1BD+1DVD"},{"$f":"VLOOKUP($D:$D,基础资料!$A:E,5,0)","v":"套"},{"$f":"VLOOKUP($D:$D,基础资料!$A:F,6,0)","v":"蓝光卡通"},null,230,null,{"$f":"SUMIF($D:$D,D282,$L:$L)+SUMIF($D:$D,D282,$J:$J)-SUMIF($D:$D,D282,$K:$K)","v":485},{"$f":"VLOOKUP(D:D,结存!A:J,10,0)","v":485},{"$f":"M282 - N282","v":0}]
["2018-01-21",null,null,621,{"$f":"VLOOKUP($D:$D,基础资料!$A:B,2,0)","v":"0703000024"},{"$f":"VLOOKUP($D:$D,基础资料!$A:C,3,0)","v":"蓝卡愤怒的小鸟1BD+1DVD"},{"$f":"VLOOKUP($D:$D,基础资料!$A:D,4,0)","v":"1BD+1DVD"},{"$f":"VLOOKUP($D:$D,基础资料!$A:E,5,0)","v":"套"},{"$f":"VLOOKUP($D:$D,基础资料!$A:F,6,0)","v":"蓝光卡通"},null,null,null,{"$f":"SUMIF($D:$D,D283,$L:$L)+SUMIF($D:$D,D283,$J:$J)-SUMIF($D:$D,D283,$K:$K)","v":485},{"$f":"VLOOKUP(D:D,结存!A:J,10,0)","v":485},{"$f":"M283 - N283","v":0}]
["2018-01-21",null,null,621,{"$f":"VLOOKUP($D:$D,基础资料!$A:B,2,0)","v":"0703000024"},{"$f":"VLOOKUP($D:$D,基础资料!$A:C,3,0)","v":"蓝卡愤怒的小鸟1BD+1DVD"},{"$f":"VLOOKUP($D:$D,基础资料!$A:D,4,0)","v":"1BD+1DVD"},{"$f":"VLOOKUP($D:$D,基础资料!$A:E,5,0)","v":"套"},{"$f":"VLOOKUP($D:$D,基础资料!$A:F,6,0)","v":"蓝光卡通"},null,null,22,{"$f":"SUMIF($D:$D,D284,$L:$L)+SUMIF($D:$D,D284,$J:$J)-SUMIF($D:$D,D284,$K:$K)","v":485},{"$f":"VLOOKUP(D:D,结存!A:J,10,0)","v":485},{"$f":"M284 - N284","v":0}]
["2018-01-21",null,null,621,{"$f":"VLOOKUP($D:$D,基础资料!$A:B,2,0)","v":"0703000024"},{"$f":"VLOOKUP($D:$D,基础资料!$A:C,3,0)","v":"蓝卡愤怒的小鸟1BD+1DVD"},{"$f":"VLOOKUP($D:$D,基础资料!$A:D,4,0)","v":"1BD+1DVD"},{"$f":"VLOOKUP($D:$D,基础资料!$A:E,5,0)","v":"套"},{"$f":"VLOOKUP($D:$D,基础资料!$A:F,6,0)","v":"蓝光卡通"},222,null,null,{"$f":"SUMIF($D:$D,D285,$L:$L)+SUMIF($D:$D,D285,$J:$J)-SUMIF($D:$D,D285,$K:$K)","v":485},{"$f":"VLOOKUP(D:D,结存!A:J,10,0)","v":485},{"$f":"M285 - N285","v":0}]
["2018-01-21",null,null,621,{"$f":"VLOOKUP($D:$D,基础资料!$A:B,2,0)","v":"0703000024"},{"$f":"VLOOKUP($D:$D,基础资料!$A:C,3,0)","v":"蓝卡愤怒的小鸟1BD+1DVD"},{"$f":"VLOOKUP($D:$D,基础资料!$A:D,4,0)","v":"1BD+1DVD"},{"$f":"VLOOKUP($D:$D,基础资料!$A:E,5,0)","v":"套"},{"$f":"VLOOKUP($D:$D,基础资料!$A:F,6,0)","v":"蓝光卡通"},null,33,null,{"$f":"SUMIF($D:$D,D286,$L:$L)+SUMIF($D:$D,D286,$J:$J)-SUMIF($D:$D,D286,$K:$K)","v":485},{"$f":"VLOOKUP(D:D,结存!A:J,10,0)","v":485},{"$f":"M286 - N286","v":0}]
["2018-01-21",null,null,1,{"$f":"VLOOKUP($D:$D,基础资料!$A:B,2,0)","v":"0001010273"},{"$f":"VLOOKUP($D:$D,基础资料!$A:C,3,0)","v":"蓝光-美女与野兽第2季贝儿的心愿1DVD+1BD"},{"$f":"VLOOKUP($D:$D,基础资料!$A:D,4,0)","v":"2"},{"$f":"VLOOKUP($D:$D,基础资料!$A:E,5,0)","v":"套"},{"$f":"VLOOKUP($D:$D,基础资料!$A:F,6,0)","v":"调用成品"},12,null,null,{"$f":"SUMIF($D:$D,D287,$L:$L)+SUMIF($D:$D,D287,$J:$J)-SUMIF($D:$D,D287,$K:$K)","v":12},{"$f":"VLOOKUP(D:D,结存!A:J,10,0)","v":12},{"$f":"M287 - N287","v":0}]
["2018-01-21",null,null,2,{"$f":"VLOOKUP($D:$D,基础资料!$A:B,2,0)","v":"0001010274"},{"$f":"VLOOKUP($D:$D,基础资料!$A:C,3,0)","v":"蓝光-八恶人1BD+1DVD"},{"$f":"VLOOKUP($D:$D,基础资料!$A:D,4,0)","v":"2"},{"$f":"VLOOKUP($D:$D,基础资料!$A:E,5,0)","v":"套"},{"$f":"VLOOKUP($D:$D,基础资料!$A:F,6,0)","v":"调用成品"},22,null,null,{"$f":"SUMIF($D:$D,D288,$L:$L)+SUMIF($D:$D,D288,$J:$J)-SUMIF($D:$D,D288,$K:$K)","v":22},{"$f":"VLOOKUP(D:D,结存!A:J,10,0)","v":22},{"$f":"M288 - N288","v":0}]
["2018-01-21",null,null,22,{"$f":"VLOOKUP($D:$D,基础资料!$A:B,2,0)","v":"0007050246"},{"$f":"VLOOKUP($D:$D,基础资料!$A:C,3,0)","v":"猫王这是它的方式（旧版)2CD"},{"$f":"VLOOKUP($D:$D,基础资料!$A:D,4,0)","v":"\\"},{"$f":"VLOOKUP($D:$D,基础资料!$A:E,5,0)","v":"套"},{"$f":"VLOOKUP($D:$D,基础资料!$A:F,6,0)","v":"CD成品"},null,5,null,{"$f":"SUMIF($D:$D,D289,$L:$L)+SUMIF($D:$D,D289,$J:$J)-SUMIF($D:$D,D289,$K:$K)","v":11},{"$f":"VLOOKUP(D:D,结存!A:J,10,0)","v":11},{"$f":"M289 - N289","v":0}]
["2018-01-21",null,null,666,{"$f":"VLOOKUP($D:$D,基础资料!$A:B,2,0)","v":"07040024"},{"$f":"VLOOKUP($D:$D,基础资料!$A:C,3,0)","v":"S-社会精神"},{"$f":"VLOOKUP($D:$D,基础资料!$A:D,4,0)","v":"\\"},{"$f":"VLOOKUP($D:$D,基础资料!$A:E,5,0)","v":"本"},{"$f":"VLOOKUP($D:$D,基础资料!$A:F,6,0)","v":"书本"},null,null,null,{"$f":"SUMIF($D:$D,D290,$L:$L)+SUMIF($D:$D,D290,$J:$J)-SUMIF($D:$D,D290,$K:$K)","v":606},{"$f":"VLOOKUP(D:D,结存!A:J,10,0)","v":606},{"$f":"M290 - N290","v":0}]

{"sheet":"基础资料","index":3,"n_rows":320,"n_cols":9,"rows_kept":320,"cut":false,"hidden":false,"merged":[]}
["内部编号","SKU","存货名称","规格","单位","存货大类","实盘数","备注","英文名"]
[1,"0001010273","蓝光-美女与野兽第2季贝儿的心愿1DVD+1BD","2","套","调用成品",0]
[2,"0001010274","蓝光-八恶人1BD+1DVD","2","套","调用成品",0]
[3,"0001010275","蓝光-石中剑50周年版 1BD+1DVD","2","套","调用成品",0]
[4,"0001010276","蓝光-绝命毒师完整版16BD","16","套","调用成品",0]
[5,"0001010277","蓝光-詹姆斯邦德（007）完整版25BD","25","套","调用成品",0]
[6,"0001010278","蓝光战争与和平 2BD","2","套","调用成品",0]
[7,"0001010279","蓝光-猫的报恩 1BD+1DVD","2","套","调用成品",0]
[8,"0001010280","蓝光-绿箭侠第3季 4BD","4","套","调用成品",0]
[9,"0001010281","蓝光-绿箭侠第2季4BD","4","套","调用成品",0]
[10,"0001010282","蓝光-绿箭侠第1季4BD","4","套","调用成品",0]
[11,"0001010283","蓝光-迪士尼动画短片合集1BD+1DVD","2","套","调用成品",0]
[12,"0001010284","蓝光-末日孤舰第2季3BD","3","套","调用成品",0]
[13,"0001010285","蓝光-乐高大电影1BD+1DVD","2","套","调用成品",0]
[14,"0001010286","蓝光-侏罗纪公园完整版6BD","6","套","调用成品",0]
[15,"0001010287","蓝光-行尸之惧第1季2BD","2","套","调用成品",0]
[16,"0001010288","蓝光-童话镇第4季5BD","5","套","调用成品",0]
[17,"0001010289","蓝光-格林第4季 5BD","5","套","调用成品",0]
[18,"0001010290","蓝光-公主与青蛙 1BD+1DVD","2","套","调用成品",0]
[19,"0007050243","自由之歌的CD盒集4CD","\\","套","CD成品",0,null,"Songs Of Freedom"]
[20,"0007050244","迪士尼经典套装4CD","\\","套","CD成品",0,null,"Disney Classics Box Set"]
[21,"0007050245","在一个盒子里的信息：完整的录音CD盒集[ 4 ]套盒4CD","\\","套","CD成品",0,null,"Message in a Box: The Complete Recording"]
[22,"0007050246","猫王这是它的方式（旧版)2CD","\\","套","CD成品",16,null,"That`s the Way It Is"]
[23,"0007050247","《终极收藏套盒5CD","\\","套","CD成品",0,null,"The Ultimate Collection"]
[25,"0601010001","14mm蓝色4碟PP盒（蓝光）","\\","个","PP盒",0]
[26,"0601010002","14mm蓝色3碟PP盒","\\","个","PP盒",0]
[27,"0602010001","BD-R","\\","片","BD碟",0]
[28,"0602010002","KL-虞美人盛开的山坡  BD碟1","\\","片","BD碟",0,null,"From Up on Poppy Hill"]
[29,"0602010003","KL-猫王-埃尔维斯之旅 BD碟1","\\","片","BD碟",0,null,"Elvis Presley - Elvis On Tour"]
[30,"0602010004","KL-地球百子第1季 BD碟1","\\","片","BD碟",0,null,"The 100: Season 1"]
[31,"0602010005","KL-地球百子第1季 BD碟2","\\","片","BD碟",0,null,"The 100: Season 1"]
[32,"0602010006","KL-地球百子第1季 BD碟3","\\","片","BD碟",0,null,"The 100: Season 1"]
[33,"0602010007","KL-奥丽芙.基特里奇 BD碟1","\\","片","BD碟",0,null,"Olive Kitteridge"]
[34,"0602010008","KL-奥丽芙.基特里奇 BD碟2","\\","片","BD碟",0,null,"Olive Kitteridge"]
[35,"0602010009","KL-死亡笔记：完整系列的标准版 BD碟1","\\","片","BD碟",0,null,"Death Note: Complete Series Standard Edition"]
[36,"0602010010","KL-死亡笔记：完整系列的标准版 BD碟2","\\","片","BD碟",0,null,"Death Note: Complete Series Standard Edition"]
[37,"0602010011","KL-死亡笔记：完整系列的标准版 BD碟3","\\","片","BD碟",0,null,"Death Note: Complete Series Standard Edition"]
[38,"0602010012","KL-死亡笔记：完整系列的标准版 BD碟4","\\","片","BD碟",0,null,"Death Note: Complete Series Standard Edition"]
[39,"0602010013","KL-死亡笔记：完整系列的标准版 BD碟5","\\","片","BD碟",0,null,"Death Note: Complete Series Standard Edition"]
[40,"0602010014","KL-硅谷：第2季 BD碟1","\\","片","BD碟",0,null,"Silicon Valley:The Complete Second Season"]
[41,"0602010015","KL-硅谷：第2季 BD碟2","\\","片","BD碟",0,null,"Silicon Valley:The Complete Second Season"]
[42,"0602010016","KL-尼克斯第2季 BD碟1","\\","片","BD碟",0,null,"The Knick The Complete Second Season"]
[43,"0602010017","KL-尼克斯第2季 BD碟2","\\","片","BD碟",0,null,"The Knick The Complete Second Season"]
[44,"0602010018","KL-尼克斯第2季 BD碟3","\\","片","BD碟",0,null,"The Knick The Complete Second Season"]
[45,"0602010019","KL-尼克斯第2季 BD碟4","\\","片","BD碟",0,null,"The Knick The Complete Second Season"]
[46,"0602010020","KL-辉夜姬物语 BD碟1","\\","片","BD碟",0,null,"The Tale of the Princess kaguya"]
[47,"0602010021","KL-元气囝仔 BD碟1","\\","片","BD碟",0,null,"Barakamon: The Complete Series"]
[48,"0602010022","KL-元气囝仔 BD碟2","\\","片","BD碟",0,null,"Barakamon: The Complete Series"]
[49,"0602010023","KL-大西洋帝国第5季 BD碟1","\\","片","BD碟",0,null,"Boarwalk Empire:Season 5"]
[50,"0602010024","KL-大西洋帝国第5季 BD碟2","\\","片","BD碟",0,null,"Boarwalk Empire:Season 5"]
[51,"0602010025","KL-大西洋帝国第5季 BD碟3","\\","片","BD碟",0,null,"Boarwalk Empire:Season 5"]
[52,"0602010026","KL-刑事 BD碟1","\\","片","BD碟",0,null,"Criminal"]
[53,"0602010027","KL-黑客军团第1季 BD碟1","\\","片","BD碟",0,null,"Mr.Robot - Season 1"]
[54,"0602010028","KL-黑客军团第1季 BD碟2","\\","片","BD碟",0,null,"Mr.Robot - Season 1"]
[55,"0602010029","KL-欢乐满人间第五十周年纪念版 BD碟1","\\","片","BD碟",0,null,"Mary Poppins:50th Anniversary edition"]
[56,"0602010030","KL-雷神：黑暗世界 BD碟1","\\","片","BD碟",0,null,"Thor:The Dark World"]
[57,"0602010031","KL-美国队长：美国队长：冬日战士 BD碟1","\\","片","BD碟",0,null,"Captain American:The Winter Soldier"]
[58,"0602010032","KL-银河护卫队 BD碟1","\\","片","BD碟",0,null,"Guardians Of The Galaxy"]
[59,"0602010033","KL-美国队长：星球大战：义军崛起第1季 BD碟1","\\","片","BD碟",0,null,"Star Wars Rebels:Season 1"]
[60,"0602010034","KL-美国队长：星球大战：义军崛起第1季 BD碟2","\\","片","BD碟",0,null,"Star Wars Rebels:Season 1"]
[61,"0602010035","KL-辛普森一家20周年特辑 BD碟2","\\","片","BD碟",0,null,"The Simpsons - Season 20(20 Years)"]
[62,"0602010036","KL-辛普森一家20周年特辑 BD碟1","\\","片","BD碟",0,null,"The Simpsons - Season 20(20 Years)"]
[63,"0602010037","KL-猫王:是这样的:特别版 BD碟1","\\","片","BD碟",0,null,"Elvis:That is the Way It is :special Edition"]
[64,"0602010038","KL-海贼王剧场版10：强者天下 BD碟1","\\","片","BD碟",0,null,"ONE PIECE FILM STRONG WORLD"]
[65,"0602010039","KL-海贼王剧场版10：强者天下 BD碟2","\\","片","BD碟",0,null,"ONE PIECE FILM STRONG WORLD"]
[66,"0602010040","KL-海贼王剧场版:Z(港) BD碟1","\\","片","BD碟",0,null,"ONE PIECE FILM:Film Z"]
[67,"0602010041","KL-海贼王剧场版:Z(港) BD碟2","\\","片","BD碟",0,null,"ONE PIECE FILM:Film Z"]
[68,"0602010042","KL-冰血暴第2季 BD碟2","\\","片","BD碟",0,null,"Fargo:Season 2"]
[69,"0602010043","KL-冰血暴第2季 BD碟1","\\","片","BD碟",0,null,"Fargo:Season 2"]
[70,"0602010044","KL-冰血暴第2季 BD碟3","\\","片","BD碟",0,null,"Fargo:Season 2"]
[71,"0602010045","KL-X战警：金刚狼 BD碟6","\\","片","BD碟",0,null,"X-men and the Wolverine Collection(X-men/X2:X-men United/X-men:The Last Stand/X-men Origins:Wolverin"]
[72,"0602010046","KL-X战警：金刚狼 BD碟4","\\","片","BD碟",0,null,"X-men and the Wolverine Collection(X-men/X2:X-men United/X-men:The Last Stand/X-men Origins:Wolverin"]
[73,"0602010047","KL-X战警：金刚狼 BD碟1","\\","片","BD碟",0,null,"X-men and the Wolverine Collection(X-men/X2:X-men United/X-men:The Last Stand/X-men Origins:Wolverin"]
[74,"0602010048","KL-X战警：金刚狼 BD碟3","\\","片","BD碟",0,null,"X-men and the Wolverine Collection(X-men/X2:X-men United/X-men:The Last Stand/X-men Origins:Wolverin"]
[75,"0602010049","KL-X战警：金刚狼 BD碟5","\\","片","BD碟",0,null,"X-men and the Wolverine Collection(X-men/X2:X-men United/X-men:The Last Stand/X-men Origins:Wolverin"]
[76,"0602010050","KL-X战警：金刚狼 BD碟2","\\","片","BD碟",0,null,"X-men and the Wolverine Collection(X-men/X2:X-men United/X-men:The Last Stand/X-men Origins:Wolverin"]
[77,"0602010051","KL-美国不为人知的历史  BD碟1","\\","片","BD碟",0,null,"The United History of the United States"]
[78,"0602010052","KL-美国队长：第一复仇者 BD碟1","\\","片","BD碟",0,null,"Captain American:The First Avenger"]
[79,"0602010053","KL-钢铁侠3 BD碟1","\\","片","BD碟",0,null,"Iron Man 3-Movie Collection"]
[80,"0602010054","KL-浴血黑帮 BD碟1","\\","片","BD碟",0,null,"Peaky Blinders"]
[81,"0602010055","KL-浴血黑帮 BD碟2","\\","片","BD碟",0,null,"Peaky Blinders"]
[82,"0602010056","KL-雷神 BD碟1","\\","片","BD碟",0,null,"Thor “Spectacular”"]
[83,"0602010057","KL-鲁邦三世：卡里奥斯特罗城 BD碟1","\\","片","BD碟",0,null,"Lupin the Third:The Castle of Cagliostro"]
[84,"0602010058","KL-我是僵尸第2季 BD碟1","\\","片","BD碟",0,null,"iZombie Season 2"]
[85,"0602010059","KL-地球百子第3季  BD碟1","\\","片","BD碟",0,null,"Person of Interest: S1-5"]
[86,"0602010060","KL-我是僵尸第2季 BD碟2","\\","片","BD碟",0,null,"iZombie Season 2"]
[87,"0602010061","KL-我是僵尸第2季 BD碟3","\\","片","BD碟",0,null,"iZombie Season 2"]
[88,"0602010062","KL-我是僵尸第2季 BD碟4","\\","片","BD碟",0,null,"iZombie Season 2"]
[89,"0602010063","KL-怪物之子 BD碟1","\\","片","BD碟",0,null,"The Boy and the Beast"]
[90,"0602010064","KL-穿越时空的少女 BD碟1","\\","片","BD碟",0,null,"The Girl Who Leapt Through Time"]
[91,"0602010065","KL-非凡的世界 BD碟1","\\","片","BD碟",0,null,"April AND THE EXTRAORDINARY WORLD"]
[92,"0602010066","KL-硬核亨利 BD碟1","\\","片","BD碟",0,null,"Hardcore Herry"]
[93,"0602010067","KL-守望者收藏版 BD碟1","\\","片","BD碟",0,null,"Watchmen"]
[94,"0602010068","KL-黑色孤儿第1季 BD碟1","\\","片","BD碟",0,null,"Orphan Black Season 1"]
[95,"0602010069","KL-好莱坞在维也纳 BD碟1","\\","片","BD碟",0,null,"Hollywood In Vienna"]
[96,"0602010070","KL-控方证人 BD碟1","\\","片","BD碟",0,null,"Witness for the Prosecution"]
[97,"0602010071","KL-钢之炼金术师完整版 BD碟1","\\","片","BD碟",0,null,"FULLMETAL ALCHEMIST The Complete Series"]
[98,"0602010072","KL-钢之炼金术师：兄弟会（上） BD碟1","\\","片","BD碟",0,null,"FULLMETAL ALCHEMIST：BROTHERHOOD Complete One"]
[99,"0602010073","KL-钢之炼金术师：兄弟会（下） BD碟1","\\","片","BD碟",0,null,"FULLMETAL ALCHEMIST：BROTHERHOOD Complete Two"]
[100,"0602010074","KL-狼之子雨与雪 BD碟1","\\","片","BD碟",0,null,"WOLF CHILDREN"]
[101,"0602010075","KL-夏日大作战 BD碟1","\\","片","BD碟",0,null,"Summer wars"]
[102,"0602010076","KL-守望者收藏版 BD碟2","\\","片","BD碟",0,null,"Watchmen"]
[103,"0602010077","KL-黑色孤儿第1季 BD碟2","\\","片","BD碟",0,null,"Orphan Black Season 1"]
[104,"0602010078","KL-钢之炼金术师完整版 BD碟2","\\","片","BD碟",0,null,"FULLMETAL ALCHEMIST The Complete Series"]
[105,"0602010079","KL-钢之炼金术师：兄弟会（上） BD碟2","\\","片","BD碟",0,null,"FULLMETAL ALCHEMIST：BROTHERHOOD Complete One"]
[106,"0602010080","KL-钢之炼金术师：兄弟会（下） BD碟2","\\","片","BD碟",0,null,"FULLMETAL ALCHEMIST：BROTHERHOOD Complete Two"]
[107,"0602010081","KL-守望者收藏版 BD碟3","\\","片","BD碟",0,null,"Watchmen"]
[108,"0602010082","KL-黑色孤儿第3季 BD碟3","\\","片","BD碟",0,null,"Orphan Black Season 3"]
[109,"0602010083","KL-钢之炼金术师完整版 BD碟3","\\","片","BD碟",0,null,"FULLMETAL ALCHEMIST The Complete Series"]
[110,"0602010084","KL-钢之炼金术师：兄弟会（上） BD碟3","\\","片","BD碟",0,null,"FULLMETAL ALCHEMIST：BROTHERHOOD Complete One"]
[111,"0602010085","KL-钢之炼金术师：兄弟会（下） BD碟3","\\","片","BD碟",0,null,"FULLMETAL ALCHEMIST：BROTHERHOOD Complete Two"]
[112,"0602010086","KL-黑色孤儿第3季 BD碟4","\\","片","BD碟",0,null,"Orphan Black Season 4"]
[113,"0602010087","KL-钢之炼金术师完整版 BD碟4","\\","片","BD碟",0,null,"FULLMETAL ALCHEMIST The Complete Series"]
[114,"0602010088","KL-钢之炼金术师：兄弟会（上） BD碟4","\\","片","BD碟",0,null,"FULLMETAL ALCHEMIST：BROTHERHOOD Complete One"]
[115,"0602010089","KL-钢之炼金术师：兄弟会（下） BD碟4","\\","片","BD碟",0,null,"FULLMETAL ALCHEMIST：BROTHERHOOD Complete Two"]
[116,"0602010090","KL-钢之炼金术师完整版 BD碟5","\\","片","BD碟",0,null,"FULLMETAL ALCHEMIST The Complete Series"]
[117,"0602010091","KL-钢之炼金术师完整版 BD碟6","\\","片","BD碟",0,null,"FULLMETAL ALCHEMIST The Complete Series"]
[118,"0602010092","KL-星际牛仔 BD碟4","\\","片","BD碟",0,null,"Cowboy Bebop"]
[119,"0602010093","KL-星际牛仔 BD碟3","\\","片","BD碟",0,null,"Cowboy Bebop"]
[120,"0602010094","KL-星际牛仔 BD碟2","\\","片","BD碟",0,null,"Cowboy Bebop"]
[121,"0602010095","KL-星际牛仔 BD碟1","\\","片","BD碟",0,null,"Cowboy Bebop"]
[122,"0602010096","KL-言叶之庭 BD碟1","\\","片","BD碟",0,null,"The Garden of Words"]
[123,"0602010097","KL-狼厅 BD碟1","\\","片","BD碟",0,null,"Masterpiece: Wolf.Hall"]
[124,"0602010098","kl-狼厅 BD碟2","\\","片","BD碟",0,null,"Masterpiece: Wolf.Hall"]
[125,"0602010099","KL-狼厅 BD碟3","\\","片","BD碟",0,null,"Masterpiece: Wolf.Hall"]
[126,"0602010100","KL-李小龙首播集 BD碟1","\\","片","BD碟",0,null,"THE BRUCE LEE PREMIERE COLLECTION"]
[127,"0602010101","KL-李小龙首播集  BD碟2","\\","片","BD碟",0,null,"THE BRUCE LEE PREMIERE COLLECTION"]
[128,"0602010102","KL-李小龙首播集 BD碟3","\\","片","BD碟",0,null,"THE BRUCE LEE PREMIERE COLLECTION"]
[129,"0602010103","KL-李小龙首播集 BD碟4","\\","片","BD碟",0,null,"THE BRUCE LEE PREMIERE COLLECTION"]
[130,"0602010104","蓝卡-虞美人盛开的山坡  D5碟1","\\","片","DVD碟和CD碟",0,null,"From Up on Poppy Hill"]
[131,"0602010105","蓝剧-大西洋帝国第5季 D5碟1","\\","片","DVD碟和CD碟",0,null,"Boarwalk Empire:Season 5"]
[132,"0602010106","蓝卡-辉夜姬物语  D5碟1","\\","片","DVD碟和CD碟",0,null,"The Tale of the Princess kaguya"]
[133,"0602010107","蓝卡-辉夜姬物语  D5碟2","\\","片","DVD碟和CD碟",0,null,"The Tale of the Princess kaguya"]
[134,"0602010108","蓝影-元气囝仔 D5碟1","\\","片","DVD碟和CD碟",0,null,"Barakamon: The Complete Series"]
[135,"0602010109","蓝影-元气囝仔 D5碟2","\\","片","DVD碟和CD碟",0,null,"Barakamon: The Complete Series"]
[136,"0602010110","蓝影-刑事  D5碟1","\\","片","DVD碟和CD碟",0,null,"Criminal"]
[137,"0602010111","蓝影-欢乐满人间第五十周年纪念版 D5碟1","\\","片","DVD碟和CD碟",0,null,"Mary Poppins:50th Anniversary edition"]
[138,"0602010112","蓝影-猫王:是这样的:特别版 D5碟1","\\","片","DVD碟和CD碟",0,null,"Elvis:That is the Way It is :special Edition"]
[139,"0602010113","蓝影-海贼王剧场版10：强者天下 D5碟1","\\","片","DVD碟和CD碟",0,null,"ONE PIECE FILM STRONG WORLD"]
[140,"0602010114","蓝影-海贼王剧场版:Z(港) D5碟1","\\","片","DVD碟和CD碟",0,null,"ONE PIECE FILM:Film Z"]
[141,"0602010115","蓝卡-怪物之子 D5碟1","\\","片","DVD碟和CD碟",0,null,"The Boy and the Beast"]
[142,"0602010116","蓝卡-穿越时空的少女 D5碟1","\\","片","DVD碟和CD碟",0,null,"The Girl Who Leapt Through Time"]
[143,"0602010117","蓝卡-非凡的世界 D5碟1","\\","片","DVD碟和CD碟",0,null,"April AND THE EXTRAORDINARY WORLD"]
[144,"0602010118","蓝卡-狼之子雨与雪 D5碟1","\\","片","DVD碟和CD碟",0,null,"WOLF CHILDREN"]
[145,"0602010119","蓝卡-夏日大作战 D5碟1","\\","片","DVD碟和CD碟",0,null,"Summer wars"]
[146,"0602010120","蓝卡-穿越时空的少女 D5碟2","\\","片","DVD碟和CD碟",0,null,"The Girl Who Leapt Through Time"]
[147,"0602010121","蓝卡-狼之子雨与雪 D5碟2","\\","片","DVD碟和CD碟",0,null,"WOLF CHILDREN"]
[148,"0602010122","蓝卡-夏日大作战 D5碟2","\\","片","DVD碟和CD碟",0,null,"Summer wars"]
[149,"0602010123","蓝卡-守望者收藏版 D5碟1","\\","片","DVD碟和CD碟",0,null,"Watchmen"]
[526,"07010001","蓝剧-地球百子第3季 4BD","4","套","蓝光电视剧",19,null,"The 100 Season 3"]
[527,"07010002","蓝剧-降世神通：科拉传奇 第2季 神灵2BD","2","套","蓝光电视剧",99,null,"The Legend of Korra: Book 2, Spirits"]
[528,"0701000232","蓝剧扫兴者 第一季2BD","2","套","蓝光电视剧",0,null,"Killjoys Season 1"]
[529,"0701000235","蓝剧传教士 第一季3BD","3","套","蓝光电视剧",90,null,"Preacher Season 1"]
[530,"07010003","蓝剧-降世神通：科拉传奇 第3季2BD","2","套","蓝光电视剧",99,null,"Legend of Korra: Book Three: Change"]
[531,"07010004","蓝剧-降世神通：科拉传奇 第4季2BD","2","套","蓝光电视剧",85,null,"The Legend of Korra: Book Four: Balance"]
[532,"07010005","蓝剧-我是僵尸第2季  4BD","4","套","蓝光电视剧",61,null,"iZombie Season 2"]
[533,"07010006","蓝剧-冰血暴第2季  3BD","3","套","蓝光电视剧",70,null,"Fargo:Season 2"]
[534,"07010008","蓝剧-我是僵尸第2季 4BD","4","套","蓝光电视剧",61,null,"iZombie Season 2"]
[535,"07010009","蓝剧-黑客军团第1季  2BD","2","套","蓝光电视剧",0,null,"Mr.Robot - Season 1"]
[536,"07010010","蓝剧-黑色孤儿第1季  2BD","2","套","蓝光电视剧",85,null,"Orphan Black Season 1"]
[537,"07010011","蓝剧-黑色孤儿第2季  2BD","2","套","蓝光电视剧",79,null,"Orphan Black Season 2"]
[538,"07010012","蓝剧-地球百子第1季 3BD","3","套","蓝光电视剧",95,null,"The 100: Season 1"]
[539,"07010013","蓝剧-黑色孤儿第3季  2BD","2","套","蓝光电视剧",86,null,"Orphan Black Season 3"]
[540,"07010014","蓝剧-硅谷：第2季  2BD","2","套","蓝光电视剧",0,null,"Silicon Valley:The Complete Second Season"]
[541,"07010015","蓝剧-黑色孤儿第4季  2BD","2","套","蓝光电视剧",63,null,"Orphan Black Season 4"]
[542,"07010016","蓝剧-大西洋帝国第5季  3BD+1DVD","4","套","蓝光电视剧",0,null,"Boarwalk Empire:Season 5"]
[543,"07010017","蓝剧-尼克斯：第2季  4BD","4","套","蓝光电视剧",0,null,"The Knick The Complete Second Season"]
[544,"07010018","蓝剧-星球大战：义军崛起第1季 2BD","2","套","蓝光电视剧",0,null,"Star Wars Rebels:Season 1"]
[545,"07010019","蓝剧-蓝光-疑犯追踪1-5季完整版  19BD","19","套","蓝光电视剧",0,null,"Person of Interest: S1-5"]
[546,"0702000006","蓝影哈利·波特与魔法石2BD","2","套","蓝光电影",0]
[547,"0702000007","蓝影哈利·波特与密室2BD","2","套","蓝光电影",0,null,"Harry Potter and the Chamber of Secrets"]
[548,"0702000008","蓝影哈利·波特与阿兹卡班的囚徒2BD","2","套","蓝光电影",0,null,"Harry Potter and the Prisoner of Azkaban"]
[549,"0702000009","蓝影哈利·波特与火焰杯2BD","2","套","蓝光电影",0,null,"Harry Potter and the Goblet of Fire"]
[550,"0702000010","蓝影哈利·波特与凤凰社2BD","2","套","蓝光电影",0,null,"Harry Potter and the Order of the Phoenix"]
[551,"0702000011","蓝影哈利·波特与混血王子2B","2","套","蓝光电影",0,null,"Harry Potter and the Half-Blood Prince"]
[552,"0702000012","蓝影哈利·与死亡圣器(上)2B","2","套","蓝光电影",0,null,"Harry Potter and the Deathly Hallows: Part 1"]
[553,"0702000013","蓝影-哈利·与死亡圣器(下)2BD","2","套","蓝光电影",0,null,"Harry Potter and the Deathly Hallows: Part 2"]
[554,"0702000014","蓝影逃亡1BD","1","套","蓝光电影",0,null,"To Have and Have Not"]
[555,"0702000015","蓝影夜长梦多1BD","1","套","蓝光电影",0,null,"The Big Sleep"]
[556,"0702000016","蓝影逃狱雪冤1BD","1","套","蓝光电影",0,null,"Dark Passage"]
[557,"0702000017","蓝影蚁人1BD+3D","2","套","蓝光电影",0,null,"Ant-Man"]
[558,"0702000018","蓝影聚焦1BD+1DVD","2","套","蓝光电影",0,null,"Spotlight"]
[559,"0702000019","蓝影天堂电影院1BD","1","套","蓝光电影",0,null,"Nuovo Cinema Paradiso"]
[560,"0702000020","蓝影西游记之大圣闹天宫1BD","1","套","蓝光电影",0,null,"The Monkey King: Havoc In Heaven&#39;s Palace"]
[561,"0702000025","蓝影爆裂鼓手1BD","1","套","蓝光电影",0,null,"Whiplash [Blu-ray]"]
[562,"0702000026","蓝影我们都为比尔着盛装1BD","1","套","蓝光电影",100,null,"Bill Cunningham New York"]
[563,"0702000027","蓝影攀登梅鲁峰1BD","1","套","蓝光电影",0,null,"Meru"]
[564,"0702000028","蓝影房间1BD","1","套","蓝光电影",0,null,"Room"]
[565,"0702000029","蓝影记住1BD","1","套","蓝光电影",0,null,"Remember"]
[566,"0702000030","蓝影夜行者1BD+1DVD","2","套","蓝光电影",0,null,"Nightcrawler"]
[567,"0702000031","蓝影特朗勃1BD","1","套","蓝光电影",0,null,"Trumbo"]
[568,"0702000032","蓝影年轻气盛1BD","1","套","蓝光电影",95,null,"Youth"]
[569,"07020001","蓝影-星际迷航：下一代电影收藏4BD","4","套","蓝光电影",0,null,"Star Trek: The Next Generation Motion Picture Collection"]
[570,"07020002","蓝影-星际迷航：原初 第1季6BD","6","套","蓝光电影",0,null,"Star Trek: Original Motion Picture Collection"]
[571,"07020003","蓝影-遇见你之前1BD+1DVD","2","套","蓝光电影",73,null,"ME BEFORE YOU"]
[572,"07020004","蓝影 -一切都会过去：淘儿唱片的浮与沉  1BD","1","套","蓝光电影",87,null,"All Things Must Pass:The rise and Fall of Tower Records"]
[573,"07020005","蓝影-猫王:是这样的:特别版  1BD+1DVD","2","套","蓝光电影",70,null,"Elvis:That is the Way It is :special Edition"]
[574,"07020006","蓝影-辛普森一家20周年特辑 2BD","2","套","蓝光电影",15,null,"The Simpsons - Season 20(20 Years)"]
[575,"07020007","蓝影-滚石乐队 完全剥离，豪华限量版亚马逊独家3BD+1SD+1CD","1","套","蓝光电影",0,null,"otally Stripped Deluxe Limited Edition Amazon Exclusive"]
[576,"07020008","蓝影-三傻大闹宝莱坞1BD","1","套","蓝光电影",72,null,"3 idiots"]
[577,"07020009","蓝影-盖世枭雄1BD","1","套","蓝光电影",73,null,"Key Largo"]
[578,"07020010","蓝影-功夫熊猫21BD+2DVD","3","套","蓝光电影",81,null,"KUNG FU PANDA 2"]
[579,"07020011","蓝影-功夫熊猫3  1BD+1DVD","2","套","蓝光电影",67,null,"KUNG FU PANDA 3"]
[580,"07020012","蓝影-钢铁侠3  1BD","1","套","蓝光电影",0,null,"Iron Man 3-Movie Collection"]
[581,"07020013","蓝影-欢乐满人间第五十周年纪念版  1BD+1DVD","2","套","蓝光电影",0,null,"Mary Poppins:50th Anniversary edition"]
[582,"07020014","蓝影 -银河护卫队  1BD","1","套","蓝光电影",77,null,"Guardians Of The Galaxy"]
[583,"07020015","蓝影-元气囝仔 2BD+2DVD","4","套","蓝光电影",94,null,"Barakamon: The Complete Series"]
[584,"07020016","蓝影-X战警：金刚狼  6BD","6","套","蓝光电影",0,null,"X-men and the Wolverine Collection(X-men/X2:X-men United/X-men:The Last Stand/X-men Origins:Wolverin"]
[585,"07020017","蓝影-刑事  1BD+1DVD","2","套","蓝光电影",4,null,"Criminal"]
[586,"07020018","蓝影-硬核亨利  1BD","1","套","蓝光电影",0,null,"Hardcore Herry"]
[587,"07020019","蓝影-名人音乐会 第二十五周年摇滚名人  2BD","2","套","蓝光电影",0,null,"THE 25THANNIVERSARY ROCK & ROLL HALL OF FAME CONCERTS"]
[588,"07020020","蓝影-猫王-埃尔维斯之旅 1BD","1","套","蓝光电影",96,null,"Elvis Presley - Elvis On Tour"]
[589,"07020021","蓝影-守望者收藏版  3BD+1DVD","4","套","蓝光电影",0,null,"Watchmen"]
[590,"07020022","蓝影-美国不为人知的历史 1BD","1","套","蓝光电影",88,null,"The United History of the United States"]
[591,"07020023","蓝影-绿野仙踪1BD","1","套","蓝光电影",82,null,"THE WIZARD OF OZ"]
[592,"07020024","蓝影-浴血黑帮  2BD","2","套","蓝光电影",0,null,"Peaky Blinders"]
[593,"07020025","蓝影-死亡笔记：完整系列的标准版  5BD","5","套","蓝光电影",0,null,"Death Note: Complete Series Standard Edition"]
[594,"07020026","蓝影-耐撕侦探1BD+1DVD","2","套","蓝光电影",95,null,"the nice guys"]
[595,"07020027","蓝影-好莱坞在维也纳  1BD","1","套","蓝光电影",0,null,"Hollywood In Vienna"]
[596,"07020028","蓝影-模仿游戏1BD+1DVD","2","套","蓝光电影",99,null,"THE IMITATION GAME"]
[597,"07020029","蓝影-奥丽芙.基特里奇 2BD","2","套","蓝光电影",0,null,"Olive Kitteridge"]
[598,"07020030","蓝影-金钱怪兽1BD","1","套","蓝光电影",90,null,"MONEY MONSTER"]
[599,"07020031","蓝影-杀死一只知更鸟1BD","1","套","蓝光电影",78,null,"To Kill a Mockingbird"]
[600,"07020032","蓝影-雷神：黑暗世界  1BD","1","套","蓝光电影",0,null,"Thor:The Dark World"]
[601,"07020033","蓝影-美国队长：第一复仇者 1BD","1","套","蓝光电影",0,null,"Captain American:The First Avenger"]
[602,"07020034","蓝影-美国队长：冬日战士  1BD","1","套","蓝光电影",0,null,"Captain American:The First Avenger"]
[603,"07020035","蓝影-雷神  1BD","1","套","蓝光电影",0,null,"Thor “Spectacular”"]
[604,"07020036","蓝影- 喷火战斗机住在温布利球场 1BD","1","套","蓝光电影",86,null,"FOO FIGHTERS LIVE AT WEMBLEY STADIUM"]
[605,"07020037","蓝影-鲁邦三世：卡里奥斯特罗城  1BD","1","套","蓝光电影",85,null,"Lupin the Third:The Castle of Cagliostro"]
[606,"07020038","蓝影-钢之炼金术师完整版 6BD","6","套","蓝光电影",43,null,"FULLMETAL ALCHEMIST The Complete Series"]
[607,"07020039","蓝影-钢之炼金术师：兄弟会（上）  4BD","4","套","蓝光电影",72,null,"FULLMETAL ALCHEMIST：BROTHERHOOD Complete One"]
[608,"07020040","蓝影-钢之炼金术师：兄弟会（下）  4BD","4","套","蓝光电影",77,null,"FULLMETAL ALCHEMIST：BROTHERHOOD Complete Two"]
[609,"07020041","蓝影-海贼王剧场版10：强者天下  1BD+1DVD","2","套","蓝光电影",89,null,"ONE PIECE FILM STRONG WORLD"]
[610,"07020042","蓝影-控方证人 1BD","1","套","蓝光电影",87,null,"Witness for the Prosecution"]
[611,"07020043","蓝影-狼厅 3BD","3","套","蓝光电影",74,null,"Masterpiece: Wolf.Hall"]
[612,"07020044","蓝影-海贼王剧场版:Z(港) 1BD+1DVD","2","套","蓝光电影",0,null,"ONE PIECE FILM:Film Z"]
[613,"07020045","蓝影-李小龙首播集  4BD","4","套","蓝光电影",65,null,"THE BRUCE LEE PREMIERE COLLECTION"]
[614,"07020046","蓝影-卡罗尔1BD","1","套","蓝光电影",84,null,"CAROL"]
[615,"07020047","蓝影-无人生还 2BD","\\","套","蓝光电影",84,null,"AND THEN THERE WERE NONE"]
[616,"07020048","蓝影-《悲惨世界》:25周年音乐会 1BD","1","套","蓝光电影",0,null,"AND THEN THERE WERE NONE"]
[617,"0703000005","蓝卡-萤火虫之墓1BD+1DVD  WM","1BD+1DVD","套","蓝光卡通",0,null,"Grave of the Fireflies"]
[618,"0703000021","蓝卡火影忍者剧场版：终章1BD+1DVD","1BD+1DVD","套","蓝光卡通",0,null,"THE LAST -NARUTO THE MOVIE"]
[619,"0703000022","蓝卡火影忍者剧场版：血狱 劇場版1BD","1","套","蓝光卡通",0,null,"Naruto Shippuden The Movie: Blood Prison"]
[620,"0703000023","蓝卡玛丽和马克斯1BD","1","套","蓝光卡通",0,null,"mary & max"]
[621,"0703000024","蓝卡愤怒的小鸟1BD+1DVD","1BD+1DVD","套","蓝光卡通",4,null,"Angry Birds"]
[622,"0703000033","蓝卡新世纪福音士3.33你可以（不）重做1BD","1","套","蓝光卡通",0,null,"Evangelion 3.33: You Can (Not) Redo"]
[623,"0703000034","蓝卡海贼王剧场版8：沙漠公主与海盗们1BD","1","套","蓝光卡通",0,null,"ONE PIECE"]
[624,"07030001","蓝卡-虞美人盛开的山坡  1BD+1DVD","2","套","蓝光卡通",86,null,"From Up on Poppy Hill"]
[625,"07030002","蓝卡-辉夜姬物语  1BD+2DVD","3","套","蓝光卡通",84,null,"The Tale of the Princess kaguya"]
[626,"0703000233","蓝卡美食总动员1BD+1DVD","1BD+1DVD","套","蓝光卡通",0,null,"Ratatouille"]
[627,"07030003","蓝卡-海洋之歌1BD+1DVD","2","套","蓝光卡通",85,null,"Song of the Sea"]
[628,"07030004","蓝卡-怪物之子 1BD+1DVD","2","套","蓝光卡通",98,null,"The Boy and the Beast"]
[629,"07030005","蓝卡-穿越时空的少女  1BD+2DVD","3","套","蓝光卡通",77,null,"The Girl Who Leapt Through Time"]
[630,"07030006","蓝卡-非凡的世界  1BD+1DVD","2","套","蓝光卡通",86,null,"The Garden of Words"]
[631,"07030007","蓝卡-狼之子雨与雪  1BD+2DVD","3","套","蓝光卡通",0,null,"WOLF CHILDREN"]
[632,"07030008","蓝卡-夏日大作战  1BD+2DVD","3","套","蓝光卡通",88,null,"SUMMER WARS"]
[633,"07030009","蓝卡-星际牛仔  4BD","4","套","蓝光卡通",9,null,"Cowboy Bebop"]
[634,"07030010","蓝卡-言叶之庭 1BD","1","套","蓝光卡通",78,null,"The Garden of Words"]
[635,"07030011","蓝卡-凉宫春日的消失  1BD+2DVD","\\","套","蓝光卡通",95,null,"The Disappearance of HARUHI SUZUMIYA"]
[636,"0704000001","S-内识心理学","\\","本","书本",756,null,"understanding psychology"]
[637,"0704000002","S-项目评价","\\","本","书本",1937,null,"Program evaluation"]
[638,"0704000003","S-人格理论","\\","本","书本",523,null,"Theory of Personality"]
[639,"0704000004","S-电器查询","\\","本","书本",223,null,"FE Electrical and copputer review manual"]
[640,"0704000035","S-商业：一个不断变化的世界","\\","本","书本",479,null,"Business a changing world"]
[641,"0704000036","S-我们的人民","\\","本","书本",2695,null,"We The People"]
[642,"07040001","S-恐怖故事（3本一套）","\\","套","书本",35,null,"SCARY STORIES to Tell in the Dark/SCARY STORIES More Tales to Chill Your Bones/MORE SCARY STORIES to"]
[643,"07040002","S-定量技术分析","\\","本","书本",570,null,"QUANTITATIVE TECHNICAL ANALYSIS(Bandy)"]
[644,"0704000293","S-环境经济学","\\","本","书本",419,null,"FINANCINGEDUCATIONINACLINAFEOF.CHANGE"]
[645,"07040003","S-公共演讲的艺术","\\","本","书本",1423,null,"THE ART OF PUBLIC SPEAKING(LUCAS)"]
[646,"07040004","S-媒体伦理","\\","本","书本",619,null,"media ethics (ISSUES & CASES)"]
[647,"07040005","S-有效的小组讨论","\\","本","书本",382,null,"Effective Group DISCUSSION(Theory and Practice"]
[648,"07040006","S-大众传媒法","\\","本","书本",19,null,"MASS MEDIA LAW"]
[649,"07040007","S-行为研究方法","\\","本","书本",4577,null,"Methods in Behavioral Research"]
[650,"07040008","S-谈判精要","\\","本","书本",538,null,"ESSENTIALS"]
[651,"07040009","S-合作、协商和团队合作","\\","本","书本",311,null,"COLLABORATION,CONSULTATION,AND TEAMWORK for Students with Special Needs (SEVENTH EDITION)"]
[652,"07040010","S-管理技能养成","\\","本","书本",292,null,"Developing Management Skills"]
[653,"07040011","S-实现改变","\\","本","书本",985,null,"IMPLEMENTING CHANGE"]
[654,"07040012","S-实践研究","\\","本","书本",1966,null,"PRACTICAL RESEARCH"]
[655,"07040013","S-校园法律","\\","本","书本",708,null,"SCHOOL LAW AND THE PUBLIC SCHOOLS"]
[656,"07040014","S-伦理护理","\\","本","书本",956,null,"ETHICAL,LEGAL,AND PROFESSIONAL ISSUES IN COUNSELING"]
[657,"07040015","S-心理学","\\","本","书本",575,null,"How to Think Straight About PSYCHOLOGY"]
[658,"07040016","S-四十项心理学的研究 821","\\","本","书本",1,null,"FORTY STUDIES THAT CHANGED PSYCHOLOGY"]
[659,"07040017","S-实习手册","\\","本","书本",934,null,"The Internship,Practicum,and Field Placement Handbook(A GUIDE FOR THE HELPING PROFESSIONS)"]
[660,"07040018","S-明了和优雅风格的教训","\\","本","书本",454,null,"Style Lessons in Clarity and Grace"]
[661,"07040019","S-美国药疗保健","\\","本","书本",975,null,"Jonas & Kovner s Health Care Delivery in the United States"]
[662,"07040020","S-硕士考试指南","\\","本","书本",2104,null,"SOCIAL WORK ASWB MASTERS EXAM GUIDE"]
[663,"07040021","S-面试技巧","\\","本","书本",595,null,"INTERVIEWING FOR SOLUTIONS"]
[664,"07040022","S-麦克的学习技巧","\\","本","书本",594,null,"Mckeachie s TEACHING TIPS"]
[665,"07040023","S-医生的护理实践","\\","本","书本",1327,null,"The Doctor of Nursing Practice"]
[666,"07040024","S-社会精神","\\","本","书本",606,null,"The Social Worker and Psychotropic Medication"]
[667,"07040025","S-临床评估工作簿","\\","本","书本",2338,null,"THE CLINICAL ASSESSMENT WORKBOOK(BALANCING STRENGTHS AND DIFFERENTIAL DIAGNOSIS)"]
[668,"07040026","S-团体咨询","\\","本","书本",1483,null,"Group counseling"]
[669,"07040027","S-小屁孩日记（9本一套）","\\","套","书本",958,null,"Diary of a Wimpy Kid(KINNEY)（1-9）"]
[670,"07040028","S-上诉辩护","\\","本","书本",703,null,"A PRACTICAL GUIDE TO APPELLATE ADVOCACY"]
[671,"07040029","S-法律研究","\\","本","书本",807,null,"Researching  the law"]
[672,"07040030","S-法律写作和分析","\\","本","书本",1012,null,"Legal Writing and Analysis"]
[673,"07040031","S-电子和计算机考试学习指南","\\","本","书本",719,null,"Study Guide for Fundamentals of Engineering(FE) Electrical & Computer CBT Exam"]
[674,"07040032","S-民事诉讼","\\","本","书本",707,null,"FE CIVIL PRACTICE PROBLEMS"]
[675,"07040033","S-机械实践","\\","本","书本",463,null,"FE MECHANICAL PRACTICE PROBLEMS"]
[676,"07040034","S-程序员考试","\\","本","书本",1412,null,"Colders  Desk Reference for Diagnoses(ICD-10-CM)"]
[677,"07040027-1","S-小屁孩日记（1/9本一套）","\\","本","书本",8,null,"Diary of a Wimpy Kid(KINNEY)（1）"]
[678,"07040027-2","S-小屁孩日记（2/9本一套）","\\","本","书本",1,null,"Diary of a Wimpy Kid(KINNEY)（2）"]
[679,"07040027-3","S-小屁孩日记（3/9本一套）","\\","本","书本",11,null,"Diary of a Wimpy Kid(KINNEY)（3）"]
[680,"07040027-4","S-小屁孩日记（4/9本一套）","\\","本","书本",15,null,"Diary of a Wimpy Kid(KINNEY)（4）"]
[681,"07040027-5","S-小屁孩日记（5/9本一套）","\\","本","书本",30,null,"Diary of a Wimpy Kid(KINNEY)（5）"]
[682,"07040027-6","S-小屁孩日记（6/9本一套）","\\","本","书本",570,null,"Diary of a Wimpy Kid(KINNEY)（6）"]
[683,"07040027-7","S-小屁孩日记（7/9本一套）","\\","本","书本",517,null,"Diary of a Wimpy Kid(KINNEY)（7）"]
[684,"07040027-8","S-小屁孩日记（8/9本一套）","\\","本","书本",454,null,"Diary of a Wimpy Kid(KINNEY)（8）"]
[685,"07040027-9","S-小屁孩日记（9/9本一套）","\\","本","书本",508,null,"Diary of a Wimpy Kid(KINNEY)（9）"]
[686,9090001,"裕丰光碟专用纸箱","\\","个","包装物料",0]
[687,9090002,"社会调查","\\","本","书本",0,null,"essential research methods for social work"]
[688,9090003,"蓝光瑞壳和莫蒂第1季1BD","\\","套","蓝光电影",0]
[689,"0701000349","奥丽芙.基特里奇2BD","\\","套","蓝光电视剧",96,null,"Olive Kitteridge [blu-ray] Digita"]
[690,"0703000344","瑞奇与叮当","\\","套","蓝光卡通",96,null,"Ratchet & Clank"]
[691,"0702000026","我们都为比尔着盛装","\\","套","蓝光电影",100,null," Bill Cunningham New York"]
[692,"0007050305","滚石乐队15CD","\\","套","CD成品"]
[693,"0702000350","星际迷航3：超越星辰","\\","套","蓝光电影"]
[694,"0701000355","贝茨旅馆第四季2BD","\\","本","蓝光电影"]
[695,"0704000366","课程指南","\\","本","书本"]
[696,"0704000368","国际业务：全球化的挑战","\\","本","书本"]

{"sheet":"说明","index":4,"n_rows":33,"n_cols":15,"rows_kept":33,"cut":false,"hidden":false,"merged":[]}
["1 单元格变化时的事件Worksheet_Change来自动填充公式，对于vlookup函数不是很好用；"]
[null,"即使下面公式也出现一些莫名其秒的问题，如开始是填充第11列，后改到第12例，但11例还在填充。如把公式都全部删除了，还是可以有效果，奇怪了；"]
[null,"Cells(X, 12).Formula = \"=SUMIF($D:$D,D\" & X & \",$I:$I)+SUMIF($D:$D,D\" & X & \",$J:$J)-SUMIF($D:$D,D\" & X & \",$K:$K)\""]
["2 单元格变化时的事件Worksheet_Change来自动跳过公式也不是很好用；"]
["3 条件求和特别慢；"]
[null,"变通的办法是把历史数据的公式复制为值，只保留最近两天的数据的公式；"]
["4 公式备份"]
["2016-11-05","11Y0072",null,621,{"$f":"VLOOKUP($D:$D,基础资料!$A:B,2,0)","v":"0703000024"},{"$f":"VLOOKUP($D:$D,基础资料!$A:C,3,0)","v":"蓝卡愤怒的小鸟1BD+1DVD"},{"$f":"VLOOKUP($D:$D,基础资料!$A:D,4,0)","v":"1BD+1DVD"},{"$f":"VLOOKUP($D:$D,基础资料!$A:F,5,0)","v":"套"},{"$f":"VLOOKUP($D:$D,基础资料!$A:F,6,0)","v":"蓝光卡通"},500,null,null,{"$f":"SUMIF($D:$D,D8,$L:$L)+SUMIF($D:$D,D8,$J:$J)-SUMIF($D:$D,D8,$K:$K)","v":500},{"$f":"VLOOKUP(D:D,#REF!,10,0)","v":{"$error":"#REF!"}},{"$f":"M8-N8","v":{"$error":"#REF!"}}]
["5 打印页面"]
[null,"5.1 有排序（透视表的排序不是很灵活）；"]
[null,"5.2 加了一列（实点）；"]
[null,"5.3 自然有各种格式化；"]
["6 VBA过程也可以添加到快速启动栏"]
[null,"Excel选项→自定义→宏→选择一个过程；"]
["7 自定义工具栏存在的问题"]
[null,"如果是在A路径下添加的工作，复制到B路径后，发现菜单下关连的过程运行不了，需要重新更新一下工具（也就是运行一下添加菜单的过程）；"]
[]
["8 数据透视表"]
[null,"水平并排/垂直并排显示透视字段：选项→选项→布局；"]
[null,"字段名称如何去除“求和项：”"]
[null,"在“编辑栏”中删除“求和项”，再在文本的最后输入一个空格；"]
[null,null,"ActiveSheet.PivotTables(\"数据透视表1\").DataPivotField.PivotItems(\"求和项:期初数量\").Caption = \"期初数量 \""]
[null,"        "]
["9 自动刷新代码"]
[null,"ThisWorkbook.RefreshAll"]
[]
["10 刷新透视表后保持原来的和格式"]
[null,"选项→布局和格式→勾选“更新时保留单元格格式”和去掉勾选“更新时自动调整列宽”；"]
[]
["11 多重合并数据透视表"]
[null,"1 在2003版的数据透视表向导中可以添加多重源数据，如果是2007版则选要调出此向导："]
[null,"快速访问工具栏→不在功能区中的命令→数据透视表和数据透视图向导→添加→确定"]
[null,"2 按向导操作即可选择多重数据源；"]

{"sheet":"打印结存","index":5,"n_rows":119,"n_cols":11,"rows_kept":119,"cut":false,"hidden":false,"merged":[]}
["内部编号","SKU","存货名称","规格","单位","存货大类","期初数量","收入数量","发出数量","结存数量","实点"]
[692,"0007050305","滚石乐队15CD","\\","套","CD成品",null,98,70,{"$f":"G2+H2-I2","v":28}]
[22,"0007050246","猫王这是它的方式（旧版)2CD","\\","套","CD成品",null,20,9,11]
[689,"0701000349","奥丽芙.基特里奇2BD","\\","套","蓝光电视剧",null,98,2,96]
[533,"07010006","蓝剧-冰血暴第2季  3BD","3","套","蓝光电视剧",72,null,2,70]
[529,"0701000235","蓝剧传教士 第一季3BD","3","套","蓝光电视剧",null,96,6,90]
[538,"07010012","蓝剧-地球百子第1季 3BD","3","套","蓝光电视剧",95,null,null,95]
[526,"07010001","蓝剧-地球百子第3季 4BD","4","套","蓝光电视剧",21,null,2,19]
[536,"07010010","蓝剧-黑色孤儿第1季  2BD","2","套","蓝光电视剧",86,null,1,85]
[537,"07010011","蓝剧-黑色孤儿第2季  2BD","2","套","蓝光电视剧",85,null,6,79]
[539,"07010013","蓝剧-黑色孤儿第3季  2BD","2","套","蓝光电视剧",83,4,1,86]
[541,"07010015","蓝剧-黑色孤儿第4季  2BD","2","套","蓝光电视剧",74,null,11,63]
[527,"07010002","蓝剧-降世神通：科拉传奇 第2季 神灵2BD","2","套","蓝光电视剧",99,null,null,99]
[530,"07010003","蓝剧-降世神通：科拉传奇 第3季2BD","2","套","蓝光电视剧",99,null,null,99]
[531,"07010004","蓝剧-降世神通：科拉传奇 第4季2BD","2","套","蓝光电视剧",85,null,null,85]
[532,"07010005","蓝剧-我是僵尸第2季  4BD","4","套","蓝光电视剧",61,null,6,55]
[534,"07010008","蓝剧-我是僵尸第2季 4BD","4","套","蓝光电视剧",61,null,null,61]
[694,"0701000355","贝茨旅馆第四季2BD","\\","本","蓝光电影",null,20,20,0]
[688,9090003,"蓝光瑞壳和莫蒂第1季1BD","\\","套","蓝光电影",null,1,1,0]
[604,"07020036","蓝影- 喷火战斗机住在温布利球场 1BD","1","套","蓝光电影",86,null,null,86]
[572,"07020004","蓝影 -一切都会过去：淘儿唱片的浮与沉  1BD","1","套","蓝光电影",87,null,null,87]
[582,"07020014","蓝影 -银河护卫队  1BD","1","套","蓝光电影",77,null,null,77]
[584,"07020016","蓝影-X战警：金刚狼  6BD","6","套","蓝光电影",null,10,10,0]
[577,"07020009","蓝影-盖世枭雄1BD","1","套","蓝光电影",73,null,null,73]
[607,"07020039","蓝影-钢之炼金术师：兄弟会（上）  4BD","4","套","蓝光电影",88,null,16,72]
[608,"07020040","蓝影-钢之炼金术师：兄弟会（下）  4BD","4","套","蓝光电影",86,null,9,77]
[606,"07020038","蓝影-钢之炼金术师完整版 6BD","6","套","蓝光电影",43,null,null,43]
[578,"07020010","蓝影-功夫熊猫21BD+2DVD","3","套","蓝光电影",89,null,8,81]
[579,"07020011","蓝影-功夫熊猫3  1BD+1DVD","2","套","蓝光电影",75,null,8,67]
[609,"07020041","蓝影-海贼王剧场版10：强者天下  1BD+1DVD","2","套","蓝光电影",89,null,null,89]
[598,"07020030","蓝影-金钱怪兽1BD","1","套","蓝光电影",90,null,null,90]
[614,"07020046","蓝影-卡罗尔1BD","1","套","蓝光电影",84,null,null,84]
[610,"07020042","蓝影-控方证人 1BD","1","套","蓝光电影",87,null,null,87]
[611,"07020043","蓝影-狼厅 3BD","3","套","蓝光电影",75,null,1,{"$f":"G34+H34-I34","v":74}]
[613,"07020045","蓝影-李小龙首播集  4BD","4","套","蓝光电影",65,null,null,65]
[605,"07020037","蓝影-鲁邦三世：卡里奥斯特罗城  1BD","1","套","蓝光电影",85,null,null,85]
[591,"07020023","蓝影-绿野仙踪1BD","1","套","蓝光电影",82,null,null,82]
[573,"07020005","蓝影-猫王:是这样的:特别版  1BD+1DVD","2","套","蓝光电影",85,null,16,69]
[588,"07020020","蓝影-猫王-埃尔维斯之旅 1BD","1","套","蓝光电影",97,null,1,96]
[590,"07020022","蓝影-美国不为人知的历史 1BD","1","套","蓝光电影",89,null,1,88]
[596,"07020028","蓝影-模仿游戏1BD+1DVD","2","套","蓝光电影",99,null,null,99]
[594,"07020026","蓝影-耐撕侦探1BD+1DVD","2","套","蓝光电影",null,98,3,95]
[568,"0702000032","蓝影年轻气盛1BD","1","套","蓝光电影",null,99,4,95]
[563,"0702000027","蓝影攀登梅鲁峰1BD","1","套","蓝光电影",null,2,2,0]
[576,"07020008","蓝影-三傻大闹宝莱坞1BD","1","套","蓝光电影",72,null,null,72]
[599,"07020031","蓝影-杀死一只知更鸟1BD","1","套","蓝光电影",79,null,1,78]
[562,"0702000026","蓝影我们都为比尔着盛装1BD","1","套","蓝光电影",null,98,null,98]
[615,"07020047","蓝影-无人生还 2BD","\\","套","蓝光电影",84,null,null,84]
[574,"07020006","蓝影-辛普森一家20周年特辑 2BD","2","套","蓝光电影",15,null,null,15]
[585,"07020017","蓝影-刑事  1BD+1DVD","2","套","蓝光电影",4,null,null,4]
[571,"07020003","蓝影-遇见你之前1BD+1DVD","2","套","蓝光电影",73,null,null,73]
[583,"07020015","蓝影-元气囝仔 2BD+2DVD","4","套","蓝光电影",98,null,4,94]
[693,"0702000350","星际迷航3：超越星辰","\\","套","蓝光电影",null,99,82,17]
[629,"07030005","蓝卡-穿越时空的少女  1BD+2DVD","3","套","蓝光卡通",77,null,null,77]
[630,"07030006","蓝卡-非凡的世界  1BD+1DVD","2","套","蓝光卡通",86,null,null,86]
[621,"0703000024","蓝卡愤怒的小鸟1BD+1DVD","1BD+1DVD","套","蓝光卡通",22,732,269,485]
[628,"07030004","蓝卡-怪物之子 1BD+1DVD","2","套","蓝光卡通",98,null,null,98]
[627,"07030003","蓝卡-海洋之歌1BD+1DVD","2","套","蓝光卡通",85,null,null,85]
[625,"07030002","蓝卡-辉夜姬物语  1BD+2DVD","3","套","蓝光卡通",84,null,null,84]
[635,"07030011","蓝卡-凉宫春日的消失  1BD+2DVD","\\","套","蓝光卡通",null,99,4,95]
[632,"07030008","蓝卡-夏日大作战  1BD+2DVD","3","套","蓝光卡通",88,null,null,88]
[633,"07030009","蓝卡-星际牛仔  4BD","4","套","蓝光卡通",19,null,10,9]
[634,"07030010","蓝卡-言叶之庭 1BD","1","套","蓝光卡通",78,null,null,78]
[624,"07030001","蓝卡-虞美人盛开的山坡  1BD+1DVD","2","套","蓝光卡通",86,null,null,86]
[690,"0703000344","瑞奇与叮当","\\","套","蓝光卡通",null,98,2,96]
[676,"07040034","S-程序员考试","\\","本","书本",1422,null,10,{"$f":"G66+H66-I66","v":1412}]
[648,"07040006","S-大众传媒法","\\","本","书本",94,null,75,19]
[639,"0704000004","S-电器查询","\\","本","书本",258,50,85,223]
[673,"07040031","S-电子和计算机考试学习指南","\\","本","书本",719,null,null,719]
[643,"07040002","S-定量技术分析","\\","本","书本",570,null,null,570]
[672,"07040030","S-法律写作和分析","\\","本","书本",0,1012,300,712]
[671,"07040029","S-法律研究","\\","本","书本",807,null,null,807]
[645,"07040003","S-公共演讲的艺术","\\","本","书本",1461,null,58,1403]
[652,"07040010","S-管理技能养成","\\","本","书本",424,null,132,292]
[649,"07040007","S-行为研究方法","\\","本","书本",4620,null,43,4577]
[651,"07040009","S-合作、协商和团队合作","\\","本","书本",314,null,3,311]
[644,"0704000293","S-环境经济学","\\","本","书本",555,null,136,419]
[675,"07040033","S-机械实践","\\","本","书本",513,null,50,463]
[642,"07040001","S-恐怖故事（3本一套）","\\","套","书本",91,null,56,35]
[667,"07040025","S-临床评估工作簿","\\","本","书本",2358,null,20,2338]
[656,"07040014","S-伦理护理","\\","本","书本",966,null,10,956]
[664,"07040022","S-麦克的学习技巧","\\","本","书本",594,null,null,594]
[646,"07040004","S-媒体伦理","\\","本","书本",619,null,null,619]
[661,"07040019","S-美国药疗保健","\\","本","书本",1029,null,54,975]
[663,"07040021","S-面试技巧","\\","本","书本",615,null,20,595]
[674,"07040032","S-民事诉讼","\\","本","书本",710,null,3,707]
[660,"07040018","S-明了和优雅风格的教训","\\","本","书本",454,null,null,454]
[636,"0704000001","S-内识心理学","\\","本","书本",979,null,323,656]
[638,"0704000003","S-人格理论","\\","本","书本",586,null,63,523]
[640,"0704000035","S-商业：一个不断变化的世界","\\","本","书本",527,null,53,474]
[670,"07040028","S-上诉辩护","\\","本","书本",703,null,null,703]
[666,"07040024","S-社会精神","\\","本","书本",606,null,null,606]
[654,"07040012","S-实践研究","\\","本","书本",2002,null,36,1966]
[659,"07040017","S-实习手册","\\","本","书本",934,null,null,934]
[653,"07040011","S-实现改变","\\","本","书本",985,null,null,985]
[662,"07040020","S-硕士考试指南","\\","本","书本",2144,null,40,2104]
[658,"07040016","S-四十项心理学的研究 821","\\","本","书本",251,null,250,1]
[650,"07040008","S-谈判精要","\\","本","书本",678,null,140,{"$f":"G98+H98-I98","v":538}]
[668,"07040026","S-团体咨询","\\","本","书本",1522,1,50,1473]
[641,"0704000036","S-我们的人民","\\","本","书本",2745,null,60,2685]
[637,"0704000002","S-项目评价","\\","本","书本",45,2021,189,1877]
[677,"07040027-1","S-小屁孩日记（1/9本一套）","\\","本","书本",8,null,null,8]
[678,"07040027-2","S-小屁孩日记（2/9本一套）","\\","本","书本",1,null,null,1]
[679,"07040027-3","S-小屁孩日记（3/9本一套）","\\","本","书本",11,null,null,11]
[680,"07040027-4","S-小屁孩日记（4/9本一套）","\\","本","书本",15,null,null,15]
[681,"07040027-5","S-小屁孩日记（5/9本一套）","\\","本","书本",30,null,null,30]
[682,"07040027-6","S-小屁孩日记（6/9本一套）","\\","本","书本",570,null,null,570]
[683,"07040027-7","S-小屁孩日记（7/9本一套）","\\","本","书本",517,null,null,517]
[684,"07040027-8","S-小屁孩日记（8/9本一套）","\\","本","书本",454,null,null,454]
[685,"07040027-9","S-小屁孩日记（9/9本一套）","\\","本","书本",508,null,null,508]
[669,"07040027","S-小屁孩日记（9本一套）","\\","套","书本",963,null,5,958]
[655,"07040013","S-校园法律","\\","本","书本",768,null,70,698]
[657,"07040015","S-心理学","\\","本","书本",575,null,null,575]
[665,"07040023","S-医生的护理实践","\\","本","书本",1327,null,null,1327]
[647,"07040005","S-有效的小组讨论","\\","本","书本",382,null,null,382]
[696,"0704000368","国际业务：全球化的挑战","\\","本","书本",null,72,40,32]
[695,"0704000366","课程指南","\\","本","书本",null,600,40,560]
[2,"0001010274","蓝光-八恶人1BD+1DVD","2","套","调用成品",null,22,null,22]
[1,"0001010273","蓝光-美女与野兽第2季贝儿的心愿1DVD+1BD","2","套","调用成品",null,12,null,12]