{"text_format":"1","workbook":"xlsx","n_sheets":2,"sheets":["Sheet3","Sheet1"],"not_rendered":{"charts":0,"images":0,"macros":1,"external_links":1,"defined_names":0,"comments":1,"pivot_tables":0},"unopened":[],"bounds":{"document_bytes":16777216,"sheet_cells":100000,"rows_first":2000,"rows_last":500,"rows_between":2000,"halvings":0,"cell_chars":16384,"cell_head_chars":4096},"cells_cut":0,"cells_raw":0,"read":"whole","date_system":"1900"}

{"sheet":"Sheet3","index":0,"n_rows":671,"n_cols":20,"rows_kept":671,"cut":false,"hidden":false,"merged":[[1,0,7,0],[8,0,14,0],[17,0,22,0],[27,0,31,0],[23,0,26,0],[37,0,41,0],[32,0,36,0],[48,0,49,0],[42,0,47,0],[56,0,58,0],[54,0,55,0],[52,0,53,0],[50,0,51,0],[68,0,69,0],[66,0,67,0],[64,0,65,0],[62,0,63,0],[59,0,61,0],[70,0,77,0],[78,0,83,0],[93,0,95,0],[84,0,89,0],[105,0,106,0],[103,0,104,0],[96,0,102,0],[107,0,112,0],[113,0,118,0],[124,0,128,0],[119,0,123,0],[138,0,139,0],[135,0,137,0],[129,0,134,0],[146,0,148,0],[143,0,145,0],[140,0,142,0],[156,0,160,0],[149,0,155,0],[170,0,174,0],[162,0,166,0],[184,0,187,0],[177,0,183,0],[192,0,195,0],[188,0,190,0],[202,0,203,0],[199,0,201,0],[196,0,198,0],[204,0,209,0],[215,0,218,0],[210,0,214,0],[227,0,228,0],[225,0,226,0],[222,0,224,0],[219,0,221,0],[229,0,236,0],[238,0,243,0],[245,0,256,0],[257,0,263,0],[264,0,269,0],[270,0,275,0],[289,0,290,0],[279,0,288,0],[291,0,298,0],[304,0,308,0],[299,0,303,0],[309,0,315,0],[316,0,323,0],[331,0,332,0],[329,0,330,0],[327,0,328,0],[324,0,326,0],[348,0,353,0],[360,0,363,0],[354,0,359,0],[368,0,371,0],[364,0,367,0],[372,0,378,0],[393,0,394,0],[387,0,390,0],[379,0,386,0],[397,0,402,0],[408,0,409,0],[403,0,407,0],[410,0,415,0],[416,0,424,0],[436,0,437,0],[425,0,432,0],[449,0,452,0],[440,0,446,0],[453,0,458,0],[459,0,465,0],[474,0,475,0],[472,0,473,0],[470,0,471,0],[468,0,469,0],[466,0,467,0],[476,0,481,0],[487,0,491,0],[482,0,486,0],[497,0,501,0],[492,0,496,0],[507,0,511,0],[502,0,506,0],[517,0,518,0],[512,0,516,0],[525,0,527,0],[523,0,524,0],[521,0,522,0],[519,0,520,0],[532,0,536,0],[528,0,531,0],[537,0,543,0],[544,0,550,0],[562,0,564,0],[559,0,561,0],[551,0,557,0],[568,0,571,0],[565,0,567,0],[578,0,579,0],[576,0,577,0],[572,0,575,0],[339,0,345,0],[333,0,338,0]]}
["成品编码","产品名称","部件编码","部件名称","颜色","包/套内数量","单位","包装编码","安全库存","最高库存","库位","单价","进仓","系列","备注",null,"成品编码","产品名称","部件编码","部件名称"]
["305010001","柱天下主管桌   FLO-D2-2318 2300*1800*760   ",305010002,"主台面板=1、","OF-0721S暖白浮雕MF",1,"包","6-1",0,"15",607,null,{"$f":"VLOOKUP(A:A,[1]进仓汇总!A$1:G$65536,7,0)","v":{"$error":"#N/A"}},"柱天下",null,null,null,{"$f":"look(#REF!,A$1:D$671,2,ROW(#REF!))","v":{"$error":"#NAME?"}},{"$f":"look(#REF!,A$1:D$671,3,ROW(#REF!))","v":{"$error":"#NAME?"}},{"$f":"+look(#REF!,A$1:D$671,4,ROW(#REF!))","v":{"$error":"#NAME?"}}]
[null,"柱天下主管桌   FLO-D2-2318 2300*1800*760   ",305010003,"附台面板=1，       异型面板=1  ","OF-0721S暖白浮雕MF",1,"包","6-2",0,"15",607,null,{"$f":"VLOOKUP(A:A,[1]进仓汇总!A$1:G$65536,7,0)","v":{"$error":"#N/A"}},"柱天下",null,null,null,{"$f":"look(#REF!,A$1:D$671,2,ROW(A2))","v":{"$error":"#NAME?"}},{"$f":"look(#REF!,A$1:D$671,3,ROW(A2))","v":{"$error":"#NAME?"}},{"$f":"+look(#REF!,A$1:D$671,4,ROW(A2))","v":{"$error":"#NAME?"}}]
[null,"柱天下主管桌   FLO-D2-2318 2300*1800*760   ","399880001-51","固定柜=1","暖白/铁灰",1,"包","6-3",0,"15",607,null,{"$f":"VLOOKUP(A:A,[1]进仓汇总!A$1:G$65536,7,0)","v":{"$error":"#N/A"}},"柱天下",null,null,null,{"$f":"look(#REF!,A$1:D$671,2,ROW(A3))","v":{"$error":"#NAME?"}},{"$f":"look(#REF!,A$1:D$671,3,ROW(A3))","v":{"$error":"#NAME?"}},{"$f":"+look(#REF!,A$1:D$671,4,ROW(A3))","v":{"$error":"#NAME?"}}]
[null,"柱天下主管桌   FLO-D2-2318 2300*1800*760   ",305010004,"D168梅花柱脚=4     托臂=8","氧化+闪银",1,"包","6-4",0,"15",607,null,{"$f":"VLOOKUP(A:A,[1]进仓汇总!A$1:G$65536,7,0)","v":{"$error":"#N/A"}},"柱天下",null,null,null,{"$f":"look(#REF!,A$1:D$671,2,ROW(A4))","v":{"$error":"#NAME?"}},{"$f":"look(#REF!,A$1:D$671,3,ROW(A4))","v":{"$error":"#NAME?"}},{"$f":"+look(#REF!,A$1:D$671,4,ROW(A4))","v":{"$error":"#NAME?"}}]
[null,"柱天下主管桌   FLO-D2-2318 2300*1800*760   ",305010005,"钢制档板=1         ","闪银",1,"包","6-5",0,"15",607,null,{"$f":"VLOOKUP(A:A,[1]进仓汇总!A$1:G$65536,7,0)","v":{"$error":"#N/A"}},"柱天下",null,null,null,{"$f":"look(#REF!,A$1:D$671,2,ROW(A5))","v":{"$error":"#NAME?"}},{"$f":"look(#REF!,A$1:D$671,3,ROW(A5))","v":{"$error":"#NAME?"}},{"$f":"+look(#REF!,A$1:D$671,4,ROW(A5))","v":{"$error":"#NAME?"}}]
[null,"柱天下主管桌   FLO-D2-2318 2300*1800*760   ",305010006,"支撑钢架=1","闪银","1","包","6-6",0,"15",607,null,{"$f":"VLOOKUP(A:A,[1]进仓汇总!A$1:G$65536,7,0)","v":{"$error":"#N/A"}},"柱天下",null,null,null,{"$f":"look(#REF!,A$1:D$671,2,ROW(A6))","v":{"$error":"#NAME?"}},{"$f":"look(#REF!,A$1:D$671,3,ROW(A6))","v":{"$error":"#NAME?"}},{"$f":"+look(#REF!,A$1:D$671,4,ROW(A6))","v":{"$error":"#NAME?"}}]
[null,"柱天下主管桌   FLO-D2-2318 2300*1800*760   ",305010007,"主机架=1 （可选）","暖白/闪银","1","包","7-7",0,"15",607,null,{"$f":"VLOOKUP(A:A,[1]进仓汇总!A$1:G$65536,7,0)","v":{"$error":"#N/A"}},"柱天下",null,null,null,{"$f":"look(#REF!,A$1:D$671,2,ROW(A7))","v":{"$error":"#NAME?"}},{"$f":"look(#REF!,A$1:D$671,3,ROW(A7))","v":{"$error":"#NAME?"}},{"$f":"+look(#REF!,A$1:D$671,4,ROW(A7))","v":{"$error":"#NAME?"}}]
["305040001","柱天下四人位 FLO-W1-2814  2800*1400*760 ",305040002,"台面板=4  ","OF-0722S暖白浮雕MF","2","包","12-1,2",0,"10","608a",null,{"$f":"VLOOKUP(A:A,[1]进仓汇总!A$1:G$65536,7,0)","v":{"$error":"#N/A"}},"柱天下",null,null,null,{"$f":"look(#REF!,A$1:D$671,2,ROW(#REF!))","v":{"$error":"#NAME?"}},{"$f":"look(#REF!,A$1:D$671,3,ROW(#REF!))","v":{"$error":"#NAME?"}},{"$f":"+look(#REF!,A$1:D$671,4,ROW(#REF!))","v":{"$error":"#NAME?"}}]
[null,"柱天下四人位 FLO-W1-2814  2800*1400*760 ","399880003-31","活动柜","暖白/铁灰","4","包","12-3,4.5.6",0,"10","C2区",null,{"$f":"VLOOKUP(A:A,[1]进仓汇总!A$1:G$65536,7,0)","v":{"$error":"#N/A"}},"柱天下",null,null,null,{"$f":"look(#REF!,A$1:D$671,2,ROW(A9))","v":{"$error":"#NAME?"}},{"$f":"look(#REF!,A$1:D$671,3,ROW(A9))","v":{"$error":"#NAME?"}},{"$f":"+look(#REF!,A$1:D$671,4,ROW(A9))","v":{"$error":"#NAME?"}}]
[null,"柱天下四人位 FLO-W1-2814  2800*1400*760 ",305040004,"D168屏风A=2","铁灰/树纹","1","包","12-7",0,"10",608,null,{"$f":"VLOOKUP(A:A,[1]进仓汇总!A$1:G$65536,7,0)","v":{"$error":"#N/A"}},"柱天下",null,null,null,{"$f":"look(#REF!,A$1:D$671,2,ROW(A10))","v":{"$error":"#NAME?"}},{"$f":"look(#REF!,A$1:D$671,3,ROW(A10))","v":{"$error":"#NAME?"}},{"$f":"+look(#REF!,A$1:D$671,4,ROW(A10))","v":{"$error":"#NAME?"}}]
[null,"柱天下四人位 FLO-W1-2814  2800*1400*760 ",305040005,"D168屏风B=2","铁灰/树纹","1","包","12-8",0,"10",608,null,{"$f":"VLOOKUP(A:A,[1]进仓汇总!A$1:G$65536,7,0)","v":{"$error":"#N/A"}},"柱天下",null,null,null,{"$f":"look(#REF!,A$1:D$671,2,ROW(A11))","v":{"$error":"#NAME?"}},{"$f":"look(#REF!,A$1:D$671,3,ROW(A11))","v":{"$error":"#NAME?"}},{"$f":"+look(#REF!,A$1:D$671,4,ROW(A11))","v":{"$error":"#NAME?"}}]
[null,"柱天下四人位 FLO-W1-2814  2800*1400*760 ",305040006,"D168屏风C=2","铁灰/树纹","2","包","12-9,10",0,"10",608,null,{"$f":"VLOOKUP(A:A,[1]进仓汇总!A$1:G$65536,7,0)","v":{"$error":"#N/A"}},"柱天下",null,null,null,{"$f":"look(#REF!,A$1:D$671,2,ROW(A12))","v":{"$error":"#NAME?"}},{"$f":"look(#REF!,A$1:D$671,3,ROW(A12))","v":{"$error":"#NAME?"}},{"$f":"+look(#REF!,A$1:D$671,4,ROW(A12))","v":{"$error":"#NAME?"}}]
[null,"柱天下四人位 FLO-W1-2814  2800*1400*760 ",305040007,"T封边1=2，T封边2=6   L封边=4","氧化","1","包","12-11",0,"10",608,null,{"$f":"VLOOKUP(A:A,[1]进仓汇总!A$1:G$65536,7,0)","v":{"$error":"#N/A"}},"柱天下"]
[null,"柱天下四人位 FLO-W1-2814  2800*1400*760 ",305040008,"屏风配件","镀锌","1","包","12-12",0,"10",608,null,{"$f":"VLOOKUP(A:A,[1]进仓汇总!A$1:G$65536,7,0)","v":{"$error":"#N/A"}},"柱天下"]
["305040003","柱天下四人位 FLO-W1-2814  2800*1400*760 ",null,"主机架=4（可选）","暖白/闪银","1","包","13-13",0,null,608,null,{"$f":"VLOOKUP(A:A,[1]进仓汇总!A$1:G$65536,7,0)","v":{"$error":"#N/A"}},"柱天下"]
["305040009","柱天下四人位 FLO-W1-2814  2800*1400*760 ",null,"新款：活动柜","暖白/铁灰",null,"包","1-1",0,null,"小房间",null,{"$f":"VLOOKUP(A:A,[1]进仓汇总!A$1:G$65536,7,0)","v":{"$error":"#N/A"}},"柱天下"]
["301010001","欧扬主管桌 OYDN-D2-1815 1800*1500*760  左边 ",null,"欧扬主管桌1800*1500*760 左边",null,null,null,null,0,"20",906,1012,{"$f":"VLOOKUP(A:A,[1]进仓汇总!A$1:G$65536,7,0)","v":{"$error":"#N/A"}},"欧扬 铁灰"]
[null,"欧扬主管桌 OYDN-D2-1815 1800*1500*760  左边 ",301010002,"L型台面板=1   ","暖白",1,"包","4-1",0,"20",906,0,{"$f":"VLOOKUP(A:A,[1]进仓汇总!A$1:G$65536,7,0)","v":{"$error":"#N/A"}},"欧扬 铁灰"]
[null,"欧扬主管桌 OYDN-D2-1815 1800*1500*760  左边 ","399010001-21","欧扬钢脚=2","碳灰",1,"包","4-2",0,"20",906,0,{"$f":"VLOOKUP(A:A,[1]进仓汇总!A$1:G$65536,7,0)","v":{"$error":"#N/A"}},"欧扬 铁灰"]
[null,"欧扬主管桌 OYDN-D2-1815 1800*1500*760  左边 ","399010002-21","欧扬挡板=1              欧扬横杆=2","碳灰",1,"包","4-3",0,"20",906,0,{"$f":"VLOOKUP(A:A,[1]进仓汇总!A$1:G$65536,7,0)","v":{"$error":"#N/A"}},"欧扬 铁灰"]
[null,"欧扬主管桌 OYDN-D2-1815 1800*1500*760  左边 ","399880001-52","固定柜=1","暖白/铁灰",1,"个","4-4",0,"20",904,0,{"$f":"VLOOKUP(A:A,[1]进仓汇总!A$1:G$65536,7,0)","v":{"$error":"#N/A"}},"欧扬 铁灰",-1]
[null,"欧扬主管桌 OYDN-D2-1815 1800*1500*760  左边 ",399010003,"主机架=1(可选）","暖白/碳灰",1,"包","5-5",0,null,904,0,{"$f":"VLOOKUP(A:A,[1]进仓汇总!A$1:G$65536,7,0)","v":{"$error":"#N/A"}},"欧扬 铁灰"]
["301010003","欧扬主管桌 OYDN-D2-1815 1800*1500*760  右边 ",301010004,"L型台面板=1  ","暖白",1,"包","4-1",0,"20",904,1012,{"$f":"VLOOKUP(A:A,[1]进仓汇总!A$1:G$65536,7,0)","v":{"$error":"#N/A"}},"欧扬 铁灰"]
[null,"欧扬主管桌 OYDN-D2-1815 1800*1500*760  右边 ","399010001-22","欧扬钢脚=2","碳灰",1,"包","4-2",0,"20",904,0,{"$f":"VLOOKUP(A:A,[1]进仓汇总!A$1:G$65536,7,0)","v":{"$error":"#N/A"}},"欧扬 铁灰"]
[null,"欧扬主管桌 OYDN-D2-1815 1800*1500*760  右边 ","399010002-22","欧扬挡板=1              欧扬横杆=2","碳灰",1,"包","4-3",0,"20",904,0,{"$f":"VLOOKUP(A:A,[1]进仓汇总!A$1:G$65536,7,0)","v":{"$error":"#N/A"}},"欧扬 铁灰"]
[null,"欧扬主管桌 OYDN-D2-1815 1800*1500*760  右边 ","399880001-53","固定柜=1","暖白/铁灰",1,"个","4-4",0,null,"E区",0,{"$f":"VLOOKUP(A:A,[1]进仓汇总!A$1:G$65536,7,0)","v":{"$error":"#N/A"}},"欧扬 铁灰"]
["301010005","欧扬主管桌 OYDN-D4-1715 1750*1500*760  左边",301010006,"主台面板=1  ","暖白浮雕",1,"包","5-1",10,"20",908,null,{"$f":"VLOOKUP(A:A,[1]进仓汇总!A$1:G$65536,7,0)","v":{"$error":"#N/A"}},"欧扬 铁灰"]
[null,"欧扬主管桌 OYDN-D4-1715 1750*1500*760  左边",301010007,"附台面板=2","暖白浮雕",1,"包","5-2",10,"20",908,null,{"$f":"VLOOKUP(A:A,[1]进仓汇总!A$1:G$65536,7,0)","v":{"$error":"#N/A"}},"欧扬 铁灰"]
[null,"欧扬主管桌 OYDN-D4-1715 1750*1500*760  左边","399010004-41","欧扬钢脚=2","碳灰",1,"包","5-3",10,"20",908,null,{"$f":"VLOOKUP(A:A,[1]进仓汇总!A$1:G$65536,7,0)","v":{"$error":"#N/A"}},"欧扬 铁灰"]
[null,"欧扬主管桌 OYDN-D4-1715 1750*1500*760  左边","399010005-41","欧扬挡板=1              欧扬横杆=2","碳灰",1,"包","5-4",10,"20",908,null,{"$f":"VLOOKUP(A:A,[1]进仓汇总!A$1:G$65536,7,0)","v":{"$error":"#N/A"}},"欧扬 铁灰"]
[null,"欧扬主管桌 OYDN-D4-1715 1750*1500*760  左边","399880001-54","固定柜=1 ","暖白/铁灰",1,"个","5-5",10,"20",908,null,{"$f":"VLOOKUP(A:A,[1]进仓汇总!A$1:G$65536,7,0)","v":{"$error":"#N/A"}},"欧扬 铁灰"]
["301010008","欧扬主管桌 OYDN-D4-1715 1750*1500*760  右边",301010009,"主台面板=1 ","暖白浮雕",1,"包","5-1",10,"20",908,null,{"$f":"VLOOKUP(A:A,[1]进仓汇总!A$1:G$65536,7,0)","v":{"$error":"#N/A"}},"欧扬 铁灰"]
[null,"欧扬主管桌 OYDN-D4-1715 1750*1500*760  右边",301010010,"附台面板=1","暖白浮雕",1,"包","5-2",10,"20",908,null,{"$f":"VLOOKUP(A:A,[1]进仓汇总!A$1:G$65536,7,0)","v":{"$error":"#N/A"}},"欧扬 铁灰"]
[null,"欧扬主管桌 OYDN-D4-1715 1750*1500*760  右边","399010004-42","欧扬钢脚=2","碳灰",1,"包","5-3",10,"20",908,null,{"$f":"VLOOKUP(A:A,[1]进仓汇总!A$1:G$65536,7,0)","v":{"$error":"#N/A"}},"欧扬 铁灰"]
[null,"欧扬主管桌 OYDN-D4-1715 1750*1500*760  右边","399010005-42","欧扬挡板=1              欧扬横杆=2","碳灰",1,"包","5-4",10,"20",908,null,{"$f":"VLOOKUP(A:A,[1]进仓汇总!A$1:G$65536,7,0)","v":{"$error":"#N/A"}},"欧扬 铁灰"]
[null,"欧扬主管桌 OYDN-D4-1715 1750*1500*760  右边","399880001-55","固定柜=1 ","暖白/铁灰",1,"个","5-5",10,"20",908,null,{"$f":"VLOOKUP(A:A,[1]进仓汇总!A$1:G$65536,7,0)","v":{"$error":"#N/A"}},"欧扬 铁灰"]
["301010011","欧扬主管桌 OYDN-D4-1715 1750*1500*760  左边",301010012,"主台面板=1  ","布纹浮雕",1,"包","5-1",10,"20",1002,null,{"$f":"VLOOKUP(A:A,[1]进仓汇总!A$1:G$65536,7,0)","v":{"$error":"#N/A"}},"欧扬 铁灰"]
[null,"欧扬主管桌 OYDN-D4-1715 1750*1500*760  左边",301010013,"附台面板=1","布纹浮雕",1,"包","5-2",10,"20",1002,null,{"$f":"VLOOKUP(A:A,[1]进仓汇总!A$1:G$65536,7,0)","v":{"$error":"#N/A"}},"欧扬 铁灰"]
[null,"欧扬主管桌 OYDN-D4-1715 1750*1500*760  左边","399010004-43","欧扬钢脚=2","碳灰",1,"包","5-3",10,"20",1002,null,{"$f":"VLOOKUP(A:A,[1]进仓汇总!A$1:G$65536,7,0)","v":{"$error":"#N/A"}},"欧扬 铁灰"]
[null,"欧扬主管桌 OYDN-D4-1715 1750*1500*760  左边","399010005-43","欧扬挡板=1              欧扬横杆=2","碳灰",1,"包","5-4",10,"20",1002,null,{"$f":"VLOOKUP(A:A,[1]进仓汇总!A$1:G$65536,7,0)","v":{"$error":"#N/A"}},"欧扬 铁灰"]
[null,"欧扬主管桌 OYDN-D4-1715 1750*1500*760  左边","399010006-31","固定柜=1 ","布纹/铁灰",1,"包","5-5",10,"20",1002,null,{"$f":"VLOOKUP(A:A,[1]进仓汇总!A$1:G$65536,7,0)","v":{"$error":"#N/A"}},"欧扬 铁灰"]
["301010014","欧扬主管桌 OYDN-D4-1715 1750*1500*760  右边",301010015,"主台面板=1  ","布纹浮雕",1,"包","5-1",10,"20",1001,null,{"$f":"VLOOKUP(A:A,[1]进仓汇总!A$1:G$65536,7,0)","v":{"$error":"#N/A"}},"欧扬 铁灰"]
[null,"欧扬主管桌 OYDN-D4-1715 1750*1500*760  右边",301010016,"附台面板=1","布纹浮雕",1,"包","5-2",10,"20",1001,null,{"$f":"VLOOKUP(A:A,[1]进仓汇总!A$1:G$65536,7,0)","v":{"$error":"#N/A"}},"欧扬 铁灰"]
[null,"欧扬主管桌 OYDN-D4-1715 1750*1500*760  右边","399010004-44","欧扬钢脚=2","碳灰",1,"包","5-3",10,"20",1001,null,{"$f":"VLOOKUP(A:A,[1]进仓汇总!A$1:G$65536,7,0)","v":{"$error":"#N/A"}},"欧扬 铁灰"]
[null,"欧扬主管桌 OYDN-D4-1715 1750*1500*760  右边","399010005-44","欧扬挡板=1              欧扬横杆=2","碳灰",1,"包","5-4",10,"20",1001,null,{"$f":"VLOOKUP(A:A,[1]进仓汇总!A$1:G$65536,7,0)","v":{"$error":"#N/A"}},"欧扬 铁灰"]
[null,"欧扬主管桌 OYDN-D4-1715 1750*1500*760  右边","399010006-32","固定柜=1 ","布纹/铁灰",1,"个","5-5",10,"20",1009,null,{"$f":"VLOOKUP(A:A,[1]进仓汇总!A$1:G$65536,7,0)","v":{"$error":"#N/A"}},"欧扬 铁灰"]
[null,"欧扬主管桌 OYDN-D4-1715 1750*1500*760  右边",399010007,"主机架=1(可选）","布纹/碳灰",1,"包","6-6",10,"20",1009,null,{"$f":"VLOOKUP(A:A,[1]进仓汇总!A$1:G$65536,7,0)","v":{"$error":"#N/A"}},"欧扬 铁灰",-7]
["301070001","欧扬长茶几 OYAN-LT   1200*600*420",301070002,"茶几面板=1 小档板=1","暖白",1,"包","2-1",15,"40",1009,null,{"$f":"VLOOKUP(A:A,[1]进仓汇总!A$1:G$65536,7,0)","v":{"$error":"#N/A"}},"欧扬 铁灰"]
[null,"欧扬长茶几 OYAN-LT   1200*600*420","399010008-21","欧扬茶几脚=2","碳灰",1,"包","2-2",15,"40",1009,null,{"$f":"VLOOKUP(A:A,[1]进仓汇总!A$1:G$65536,7,0)","v":{"$error":"#N/A"}},"欧扬 铁灰"]
["301080001","欧扬方茶几 OYAN-ST   600*600*420",301080002,"茶几面板=1 小档板=1","暖白",1,"包","2-1",25,"40",1009,null,{"$f":"VLOOKUP(A:A,[1]进仓汇总!A$1:G$65536,7,0)","v":{"$error":"#N/A"}},"欧扬 铁灰"]
[null,"欧扬方茶几 OYAN-ST   600*600*420","399010009-21","欧扬茶几脚=2","碳灰",1,"包","2-2",25,"40",1009,null,{"$f":"VLOOKUP(A:A,[1]进仓汇总!A$1:G$65536,7,0)","v":{"$error":"#N/A"}},"欧扬 铁灰"]
["301080003","欧扬方茶几    OYAN-ST   600*600*420","399010019-21","茶几面板=1 小档板=1","布纹",1,"包","2-1",0,"20",909,null,{"$f":"VLOOKUP(A:A,[1]进仓汇总!A$1:G$65536,7,0)","v":{"$error":"#N/A"}},"欧扬 铁灰"]
[null,"欧扬方茶几    OYAN-ST   600*600*420","399010009-22","欧扬茶几脚=2","碳灰",1,"包","2-2",0,"20",909,null,{"$f":"VLOOKUP(A:A,[1]进仓汇总!A$1:G$65536,7,0)","v":{"$error":"#N/A"}},"欧扬 铁灰"]
["301070003","欧扬长茶几    OYAN-LT   1200*600*420","399010020-21","茶几面板=1 小档板=1","布纹",1,"包","2-1",0,"20",909,null,{"$f":"VLOOKUP(A:A,[1]进仓汇总!A$1:G$65536,7,0)","v":{"$error":"#N/A"}},"欧扬 铁灰"]
[null,"欧扬长茶几    OYAN-LT   1200*600*420","399010008-22","欧扬茶几脚=2","碳灰",1,"包","2-2",0,"20",909,null,{"$f":"VLOOKUP(A:A,[1]进仓汇总!A$1:G$65536,7,0)","v":{"$error":"#N/A"}},"欧扬 铁灰"]
["301110001","欧扬蝴蝶型会议桌  OYAN-T3-2812 2800*1200*750 ","399010010-21","台面板=2  平铁=2 ","布纹浮雕",1,"包","3-1",10,"20","907B",null,{"$f":"VLOOKUP(A:A,[1]进仓汇总!A$1:G$65536,7,0)","v":{"$error":"#N/A"}},"欧扬 铁灰"]
[null,"欧扬蝴蝶型会议桌  OYAN-T3-2812 2800*1200*750 ",301110002,"欧扬钢脚C=2 欧扬钢脚D=1 加固圆盘=2","碳灰",1,"包","3-2",10,"20","907C",null,{"$f":"VLOOKUP(A:A,[1]进仓汇总!A$1:G$65536,7,0)","v":{"$error":"#N/A"}},"欧扬 铁灰"]
[null,"欧扬蝴蝶型会议桌  OYAN-T3-2812 2800*1200*750 ",301110003,"欧扬走线槽=2  欧扬横杆=4","碳灰",1,"包","3-3",10,"20","907C",null,{"$f":"VLOOKUP(A:A,[1]进仓汇总!A$1:G$65536,7,0)","v":{"$error":"#N/A"}},"欧扬 铁灰"]
["301110004","欧扬直型会议桌     OYAN-T2-2812 2800*1200*750 ",301110005,"台面板=2","暖白",1,"包","3-1",0,"20","908A",null,{"$f":"VLOOKUP(A:A,[1]进仓汇总!A$1:G$65536,7,0)","v":{"$error":"#N/A"}},"欧扬 铁灰"]
[null,"欧扬直型会议桌     OYAN-T2-2812 2800*1200*750 ",301110006,"欧扬钢脚C=2 欧扬钢脚D=1 加固圆盘=2","碳灰",1,"包","3-2",0,"20","908C",null,{"$f":"VLOOKUP(A:A,[1]进仓汇总!A$1:G$65536,7,0)","v":{"$error":"#N/A"}},"欧扬 铁灰"]
[null,"欧扬直型会议桌     OYAN-T2-2812 2800*1200*750 ",301110007,"欧扬走线槽=2  欧扬横杆=4","碳灰",1,"包","3-3",0,"20","908C",null,{"$f":"VLOOKUP(A:A,[1]进仓汇总!A$1:G$65536,7,0)","v":{"$error":"#N/A"}},"欧扬 铁灰"]
["301100001","欧扬圆台       OYAN-T1-10  1000*750",301100002,"圆台面=1","暖白浮雕",1,"包","2-1",10,"20",910,410,{"$f":"VLOOKUP(A:A,[1]进仓汇总!A$1:G$65536,7,0)","v":{"$error":"#N/A"}},"欧扬 铁灰"]
[null,"欧扬圆台       OYAN-T1-10  1000*750","399010011-21","欧扬钢脚架=3 三角管=1","碳灰",1,"包","2-2",10,"20",910,0,{"$f":"VLOOKUP(A:A,[1]进仓汇总!A$1:G$65536,7,0)","v":{"$error":"#N/A"}},"欧扬 铁灰"]
["301100003","欧扬圆台    OYAN-YT-80  800*750",301100004,"圆台面=1","暖白浮雕 ",1,"包","2-1",10,"20","910B",350,{"$f":"VLOOKUP(A:A,[1]进仓汇总!A$1:G$65536,7,0)","v":{"$error":"#N/A"}},"欧扬 铁灰"]
[null,"欧扬圆台    OYAN-YT-80  800*750","399010012-21","欧扬钢脚架=3 三角管=1   配件包","碳灰",1,"包","2-2",10,"20",910,0,{"$f":"VLOOKUP(A:A,[1]进仓汇总!A$1:G$65536,7,0)","v":{"$error":"#N/A"}},"欧扬 铁灰"]
["301100005","欧扬圆台       OYAN-T1-10  1000*750",301100006,"圆台面=1","布纹",1,"包","2-1",0,"20",910,410,{"$f":"VLOOKUP(A:A,[1]进仓汇总!A$1:G$65536,7,0)","v":{"$error":"#N/A"}},"欧扬 铁灰"]
[null,"欧扬圆台       OYAN-T1-10  1000*750","399010011-22","欧扬钢脚架=3 三角管=1","碳灰",1,"包","2-2",0,"20",910,0,{"$f":"VLOOKUP(A:A,[1]进仓汇总!A$1:G$65536,7,0)","v":{"$error":"#N/A"}},"欧扬 铁灰"]
["301100007","欧扬圆台       OYAN-YT-80  800*750",301100008,"圆台面=1","布纹",1,"包","2-1",0,"20",909,null,{"$f":"VLOOKUP(A:A,[1]进仓汇总!A$1:G$65536,7,0)","v":{"$error":"#N/A"}},"欧扬 铁灰"]
[null,"欧扬圆台       OYAN-YT-80  800*750","399010012-22","欧扬钢脚架=3 三角管=1   配件包","布纹",1,"包","2-2",0,"20","909C",null,{"$f":"VLOOKUP(A:A,[1]进仓汇总!A$1:G$65536,7,0)","v":{"$error":"#N/A"}},"欧扬 铁灰"]
["301030001","欧扬蝴蝶型四人位           OYAN-W2-2929 2900*2900*760   （带副台）","399010013-31","台面板=2、","布纹/浮雕",2,"包","11-1、2",0,"15","903A/B",null,{"$f":"VLOOKUP(A:A,[1]进仓汇总!A$1:G$65536,7,0)","v":{"$error":"#N/A"}},"欧扬 铁灰"]
[null,"欧扬蝴蝶型四人位           OYAN-W2-2929 2900*2900*760   （带副台）",301030002,"副台面板=4  平铁=8","布纹/浮雕",1,"包","11-11",0,"15","903B",null,{"$f":"VLOOKUP(A:A,[1]进仓汇总!A$1:G$65536,7,0)","v":{"$error":"#N/A"}},"欧扬 铁灰"]
[null,"欧扬蝴蝶型四人位           OYAN-W2-2929 2900*2900*760   （带副台）",301030003,"D168桌上屏风=2","碳灰/树纹",1,"包","11-9",0,"15","903B",null,{"$f":"VLOOKUP(A:A,[1]进仓汇总!A$1:G$65536,7,0)","v":{"$error":"#N/A"}},"欧扬 铁灰"]
[null,"欧扬蝴蝶型四人位           OYAN-W2-2929 2900*2900*760   （带副台）","399010014-21","欧扬钢脚C=2 欧扬钢脚D=1 加固圆盘=2","碳灰",1,"包","11-7",0,"15",903,null,{"$f":"VLOOKUP(A:A,[1]进仓汇总!A$1:G$65536,7,0)","v":{"$error":"#N/A"}},"欧扬 铁灰"]
[null,"欧扬蝴蝶型四人位           OYAN-W2-2929 2900*2900*760   （带副台）","399010016-31","功能梁=2","氧化",1,"包","11-10",0,"15","903C",null,{"$f":"VLOOKUP(A:A,[1]进仓汇总!A$1:G$65536,7,0)","v":{"$error":"#N/A"}},"欧扬 铁灰"]
[null,"欧扬蝴蝶型四人位           OYAN-W2-2929 2900*2900*760   （带副台）","399010015-21","欧扬走线槽=2 欧扬横杆B=4","碳灰",1,"包","11-8",0,"15","903B",null,{"$f":"VLOOKUP(A:A,[1]进仓汇总!A$1:G$65536,7,0)","v":{"$error":"#N/A"}},"欧扬 铁灰"]
[null,"欧扬蝴蝶型四人位           OYAN-W2-2929 2900*2900*760   （带副台）","399010006-33","固定柜=1 ","布纹/铁灰",4,"个","11-3、4.5.6",0,"60","C2区",null,{"$f":"VLOOKUP(A:A,[1]进仓汇总!A$1:G$65536,7,0)","v":{"$error":"#N/A"}},"欧扬 铁灰"]
[null,"欧扬蝴蝶型四人位           OYAN-W2-2929 2900*2900*760   （带副台）",399010017,"主机架=4（可选）","布纹/碳灰",1,"包","12-12",0,"15",903,null,{"$f":"VLOOKUP(A:A,[1]进仓汇总!A$1:G$65536,7,0)","v":{"$error":"#N/A"}},"欧扬 铁灰"]
["301040008","欧扬蝴蝶型四人位        OYAN-W2-2913  2900*1300*760   （无副台）       ","399010013-32","台面板=2","布纹/浮雕",2,"包","10-1，2",20,"40",902,null,{"$f":"VLOOKUP(A:A,[1]进仓汇总!A$1:G$65536,7,0)","v":{"$error":"#N/A"}},"欧扬 铁灰"]
[null,"欧扬蝴蝶型四人位        OYAN-W2-2913  2900*1300*760   （无副台）       ","399010018-21","桌上屏风=2","铁灰",1,"包","10-9",10,"20",902,null,{"$f":"VLOOKUP(A:A,[1]进仓汇总!A$1:G$65536,7,0)","v":{"$error":"#N/A"}},"欧扬 铁灰"]
{"$rows_left_out":592}
{"sheet":"Sheet1","index":1,"n_rows":4,"n_cols":1,"rows_kept":4,"cut":false,"hidden":false,"merged":[]}
["行路难，行路难"]
["多歧路，今安在"]
["乘风破浪会有时"]
["直挂云帆济沧海"]