{"text_format":"1","workbook":"xlsx","n_sheets":8,"sheets":["包含字符筛选","明细","基础资料","广州锦盛10月份包材仓电子帐 (2)","Sheet1","问题记录","统计","Sheet2"],"not_rendered":{"charts":0,"images":0,"macros":1,"external_links":0,"defined_names":7,"comments":1,"pivot_tables":1},"unopened":[],"bounds":{"document_bytes":16777216,"sheet_cells":100000,"rows_first":2000,"rows_last":500,"rows_between":2000,"halvings":0,"cell_chars":16384,"cell_head_chars":4096},"cells_cut":0,"cells_raw":0,"read":"whole","date_system":"1900"}

{"sheet":"包含字符筛选","index":0,"n_rows":3,"n_cols":6,"rows_kept":3,"cut":false,"hidden":false,"merged":[]}
[null,"物料名称"]
[null,{"$f":"\"*\"&C2&\"*\"","v":"*盒*"},"盒",null,null,"托"]
[null,null,null,null,null,"盒"]

{"sheet":"明细","index":1,"n_rows":24,"n_cols":16,"rows_kept":24,"cut":false,"hidden":false,"merged":[]}
["日期","日期","订单号","单号","物料内部编号","客户名称","产品名称","物料名称","物料规格","单位","供应商名称","期初数量","收入数量","发出数量","备 注","公式结存"]
["2017-08-17",{"$f":"TEXT(A2,\"yyyymmdd\")","v":"20170817"},"D001",345,1,"洁士宝","纳米超浓缩洗衣片","白色内托","30片","PCS",null,{"$f":"VLOOKUP(E:E,基础资料!B:M,12,0)","v":202},null,null,null,{"$f":"SUMIF(E:E,E2,L:L)+SUMIF(E:E,E2,M:M)-SUMIF(E:E,E2,N:N)","v":502}]
["2017-08-17",{"$f":"TEXT(A3,\"yyyymmdd\")","v":"20170817"},"D001",345,2,"洁士宝","纳米超浓缩洗衣片","彩盒","50片","PCS",null,{"$f":"VLOOKUP(E:E,基础资料!B:M,12,0)","v":150},null,null,null,{"$f":"SUMIF(E:E,E3,L:L)+SUMIF(E:E,E3,M:M)-SUMIF(E:E,E3,N:N)","v":450}]
["2017-08-17","20170817","D001",345,3,"洁士宝","纳米超浓缩洗衣片","粉色封套","30片","PCS",null,{"$f":"VLOOKUP(E:E,基础资料!B:M,12,0)","v":230},null,null,null,{"$f":"SUMIF(E:E,E4,L:L)+SUMIF(E:E,E4,M:M)-SUMIF(E:E,E4,N:N)","v":530}]
["2017-08-17","20170817","D001",345,4,"洁士宝","纳米超浓缩洗衣片","粉色内托","30片","PCS",null,{"$f":"VLOOKUP(E:E,基础资料!B:M,12,0)","v":195},null,null,null,{"$f":"SUMIF(E:E,E5,L:L)+SUMIF(E:E,E5,M:M)-SUMIF(E:E,E5,N:N)","v":495}]
["2017-08-17","20170817","D001",345,5,"洁士宝","纳米超浓缩洗衣片","红色封套","30片","PCS",null,{"$f":"VLOOKUP(E:E,基础资料!B:M,12,0)","v":224},null,null,null,{"$f":"SUMIF(E:E,E6,L:L)+SUMIF(E:E,E6,M:M)-SUMIF(E:E,E6,N:N)","v":524}]
["2017-10-17","20171017","D003",346,1,"洁士宝","纳米超浓缩洗衣片","白色内托","30片","PCS",null,null,500,null,null,{"$f":"SUMIF(E:E,E7,L:L)+SUMIF(E:E,E7,M:M)-SUMIF(E:E,E7,N:N)","v":502}]
["2017-10-17","20171017","D003",345,2,"洁士宝","纳米超浓缩洗衣片","彩盒","50片","PCS",null,null,500,null,null,{"$f":"SUMIF(E:E,E8,L:L)+SUMIF(E:E,E8,M:M)-SUMIF(E:E,E8,N:N)","v":450}]
["2017-10-17","20171017","D003",345,3,"洁士宝","纳米超浓缩洗衣片","粉色封套","30片","PCS",null,null,500,null,null,{"$f":"SUMIF(E:E,E9,L:L)+SUMIF(E:E,E9,M:M)-SUMIF(E:E,E9,N:N)","v":530}]
["2017-10-17","20171017","D003",345,4,"洁士宝","纳米超浓缩洗衣片","粉色内托","30片","PCS",null,null,500,null,null,{"$f":"SUMIF(E:E,E10,L:L)+SUMIF(E:E,E10,M:M)-SUMIF(E:E,E10,N:N)","v":495}]
["2017-10-17","20171017","D003",345,5,"洁士宝","纳米超浓缩洗衣片","红色封套","30片","PCS",null,null,500,null,null,{"$f":"SUMIF(E:E,E11,L:L)+SUMIF(E:E,E11,M:M)-SUMIF(E:E,E11,N:N)","v":524}]
["2017-10-17","20171017","D003",346,1,"洁士宝","纳米超浓缩洗衣片","白色内托","30片","PCS",null,null,null,200,null,{"$f":"SUMIF(E:E,E12,L:L)+SUMIF(E:E,E12,M:M)-SUMIF(E:E,E12,N:N)","v":502}]
["2017-10-17","20171017","D003",345,2,"洁士宝","纳米超浓缩洗衣片","彩盒","50片","PCS",null,null,null,200,null,{"$f":"SUMIF(E:E,E13,L:L)+SUMIF(E:E,E13,M:M)-SUMIF(E:E,E13,N:N)","v":450}]
["2017-10-17","20171017","D003",345,3,"洁士宝","纳米超浓缩洗衣片","粉色封套","30片","PCS",null,null,null,200,null,{"$f":"SUMIF(E:E,E14,L:L)+SUMIF(E:E,E14,M:M)-SUMIF(E:E,E14,N:N)","v":530}]
["2017-10-17","20171017","D003",345,4,"洁士宝","纳米超浓缩洗衣片","粉色内托","30片","PCS",null,null,null,200,null,{"$f":"SUMIF(E:E,E15,L:L)+SUMIF(E:E,E15,M:M)-SUMIF(E:E,E15,N:N)","v":495}]
["2017-10-17","20171017","D003",345,5,"洁士宝","纳米超浓缩洗衣片","红色封套","30片","PCS",null,null,null,200,null,{"$f":"SUMIF(E:E,E16,L:L)+SUMIF(E:E,E16,M:M)-SUMIF(E:E,E16,N:N)","v":524}]
["2017-08-17","20170817","D001",345,6,"洁士宝","纳米超浓缩洗衣片","红色封套次品","20片","PCS",null,{"$f":"VLOOKUP(E:E,基础资料!B:M,12,0)","v":0},null,null,null,{"$f":"SUMIF(E:E,E17,L:L)+SUMIF(E:E,E17,M:M)-SUMIF(E:E,E17,N:N)","v":0}]
["2017-08-17","20170817","D001",345,7,"洁士宝","纳米超浓缩洗衣片","红色封套次品","50片","PCS",null,{"$f":"VLOOKUP(E:E,基础资料!B:M,12,0)","v":0},null,null,null,{"$f":"SUMIF(E:E,E18,L:L)+SUMIF(E:E,E18,M:M)-SUMIF(E:E,E18,N:N)","v":0}]
["2017-08-17","20170817","D001",345,8,"洁士宝","纳米超浓缩洗衣片","红色内托","30片","PCS",null,{"$f":"VLOOKUP(E:E,基础资料!B:M,12,0)","v":208},null,null,null,{"$f":"SUMIF(E:E,E19,L:L)+SUMIF(E:E,E19,M:M)-SUMIF(E:E,E19,N:N)","v":208}]
["2017-08-17","20170817","D001",345,9,"洁士宝","纳米超浓缩洗衣片","蓝色封套","30片","PCS",null,{"$f":"VLOOKUP(E:E,基础资料!B:M,12,0)","v":225},null,null,null,{"$f":"SUMIF(E:E,E20,L:L)+SUMIF(E:E,E20,M:M)-SUMIF(E:E,E20,N:N)","v":225}]
["2017-08-17","20170817","D001",345,10,"洁士宝","纳米超浓缩洗衣片","铝袋","3片","PCS",null,{"$f":"VLOOKUP(E:E,基础资料!B:M,12,0)","v":2000},null,null,null,{"$f":"SUMIF(E:E,E21,L:L)+SUMIF(E:E,E21,M:M)-SUMIF(E:E,E21,N:N)","v":2000}]
[null,null,null,null,11,"洁士宝","纳米超浓缩洗衣片","吸塑盖","30片","PCS",null,{"$f":"VLOOKUP(E:E,基础资料!B:M,12,0)","v":280},null,null,null,{"$f":"SUMIF(E:E,E22,L:L)+SUMIF(E:E,E22,M:M)-SUMIF(E:E,E22,N:N)","v":280}]
[null,null,null,null,12,"洁士宝","纳米超浓缩洗衣片","吸塑盖","50片","PCS",null,{"$f":"VLOOKUP(E:E,基础资料!B:M,12,0)","v":160},null,null,null,{"$f":"SUMIF(E:E,E23,L:L)+SUMIF(E:E,E23,M:M)-SUMIF(E:E,E23,N:N)","v":160}]
[null,null,null,null,13,"洁士宝","纳米超浓缩洗衣片","吸塑盒","50片","PCS",null,{"$f":"VLOOKUP(E:E,基础资料!B:M,12,0)","v":169},null,null,null,{"$f":"SUMIF(E:E,E24,L:L)+SUMIF(E:E,E24,M:M)-SUMIF(E:E,E24,N:N)","v":169}]

{"sheet":"基础资料","index":2,"n_rows":504,"n_cols":19,"rows_kept":504,"cut":false,"hidden":false,"merged":[]}
["原始顺序","物料内部编号","客户名称","产品名称","物料名称","物料规格","单位","本月结存","本月入库","本月出库","备 注","上月结存","盘点数据","差异","单据编号","入库数量","单据编号","出库数量"]
[1,241,"田惠","轻盈紧实精华油","瓶子","5ml","PCS",9855,0,0,null,9855,9855,{"$f":"+M2-H2","v":0}]
[2,238,"田惠","轻盈紧实精华油","内塞","5ml","PCS",19572,0,0,null,19572,19530,-42]
[3,239,"田惠","轻盈紧实精华霜","瓶子","10ml","PCS",9772,0,0,null,9772,9810,38]
[4,240,"田惠","魅之秀葫芦瓶","瓶子","50ml","PCS",844,0,0,null,844,924,80]
[5,245,"田惠","魅之秀垫片",null,"50ml","PCS",844,0,0,null,844,844,0]
[6,246,"田惠","魅之秀内塞",null,"50ml","PCS",844,0,0,null,844,860,16]
[7,247,"田惠","魅之秀盖子",null,"50ml","PCS",844,0,0,null,844,844,0]
[8,236,"田惠","轻盈紧实精华油","盖子","5ml","PCS",23800,0,0,null,23800,23800,0]
[9,244,"田惠","轻盈紧实精华油","亚金盖","10ml","PCS",null,0,0,null,null,19530,19530]
[10,243,"田惠","魅立秀轻盈紧致套盒","套盒",null,"PCS",352,0,0,null,352,352,0]
[11,237,"田惠","魅立秀轻盈紧致","海棉",null,"PCS",350,0,0,null,350,436,86]
[12,242,"田惠","魅立秀轻盈紧致","收缩膜",null,null,530,null,null,null,530,210,-320]
[13,13,"洁士宝","纳米超浓缩洗衣片","吸塑盒","50片","PCS",169,169,0,null,null,169,null,null,169]
[14,12,"洁士宝","纳米超浓缩洗衣片","吸塑盖","50片","PCS",160,160,0,null,null,160,null,null,160]
[15,15,"洁士宝","纳米超浓缩洗衣片","专用纸箱",null,"PCS",0,0,0,null,null,0]
[16,2,"洁士宝","纳米超浓缩洗衣片","彩盒","50片","PCS",150,150,0,null,null,150,null,null,150]
[17,4,"洁士宝","纳米超浓缩洗衣片","粉色内托","30片","PCS",195,195,0,null,null,195,null,null,195]
[18,8,"洁士宝","纳米超浓缩洗衣片","红色内托","30片","PCS",208,208,0,null,null,208,null,null,208]
[19,1,"洁士宝","纳米超浓缩洗衣片","白色内托","30片","PCS",202,202,0,null,null,202,null,null,202]
[20,3,"洁士宝","纳米超浓缩洗衣片","粉色封套","30片","PCS",230,230,0,null,null,230,null,null,230]
[21,5,"洁士宝","纳米超浓缩洗衣片","红色封套","30片","PCS",224,224,0,null,null,224,null,null,224]
[22,9,"洁士宝","纳米超浓缩洗衣片","蓝色封套","30片","PCS",225,225,0,null,null,225,null,null,225]
[23,10,"洁士宝","纳米超浓缩洗衣片","铝袋","3片","PCS",2000,2000,0,null,null,2000,null,null,2000]
[24,14,"洁士宝","纳米超浓缩洗衣片","中盒",null,"PCS",0,0,0,null,null,0]
[25,6,"洁士宝","纳米超浓缩洗衣片","红色封套次品","20片","PCS",0,0,0,null,null,0]
[26,7,"洁士宝","纳米超浓缩洗衣片","红色封套次品","50片","PCS",0,0,0,null,null,0]
[27,11,"洁士宝","纳米超浓缩洗衣片","吸塑盖","30片","PCS",280,280,0,null,null,280,null,null,280]
[28,65,"郎顿","幻彩活力素","折断瓶","2ml","PCS",70,0,0,null,70]
[29,66,"郎顿","维斯润泽乳","折断瓶","2ml","PCS",0,0,0]
[30,69,"郎顿","内塞",null,"2ml","PCS",0,0,0]
[31,70,"郎顿","顶针",null,"2ml","PCS",0,0,0]
[32,63,"郎顿","幻彩按摩霜","折断瓶","10g","PCS",140,0,0,null,140]
[33,31,"郎顿","幻彩按摩霜","内塞","10g","PCS",0,0,0]
[34,26,"郎顿","幻彩按摩霜","顶针","10g","PCS",0,0,0]
[35,41,"郎顿","幻彩爽柔露","喷雾瓶","5ml","PCS",0,0,0]
[36,40,"郎顿","幻彩爽柔露","喷雾泵头","5ml","PCS",0,0,0]
[37,48,"郎顿","风华绝代","套盒",null,"PCS",15,0,0,"盘点",15]
[38,23,"郎顿","风华绝代","标签",null,"PCS",950,0,0,"盘点",950]
[39,45,"郎顿","风华绝代","收缩膜",null,"PCS",500,0,0,"盘点",500]
[40,32,"郎顿","风华绝代","牛油纸",null,"PCS",550,0,0,"盘点",550]
[41,49,"郎顿","性香元液","套盒",null,"PCS",12,0,0,"次品",12]
[42,24,"郎顿","性香元液","标签",null,"PCS",500,0,0,"盘点",500]
[43,33,"郎顿","性香元液","牛油纸",null,"PCS",500,0,0,"盘点",500]
[44,46,"郎顿","性香元液","收缩膜",null,"PCS",600,0,0,"盘点",600]
[45,25,"郎顿","性香元液","玻璃瓶","10ml",null,260,0,0,"盘点",260]
[46,27,"郎顿","性香元液","金色喷头","10ml",null,0,0,0,"盘点"]
[47,28,"郎顿","性香元液","金色外罩","10ml",null,0,0,0,"盘点"]
[48,61,"郎顿","维斯蜜语","印花","13分","PCS",467,0,0,"盘点",467]
[49,64,"郎顿","爱慕柔情霜","折断瓶","2g","PCS",0,0,0]
[50,43,"郎顿","维斯蜜语凝香露","瓶子","30ml","PCS",498,0,0]
[51,21,"郎顿","维斯蜜语凝香露","泵头","30ml","PCS",1325,0,0,null,825]
[52,20,"郎顿","维斯蜜语凝香露","白色外罩","30ml","PCS",500,0,0]
[53,50,"郎顿","维斯润泽乳","套盒",null,"PCS",1400,0,0,null,1400]
[54,51,"郎顿","凝香露","套盒",null,"PCS",0,0,0]
[55,62,"郎顿","维斯蜜语","印花","500分","PCS",800,0,0,null,800]
[56,67,"郎顿","维斯润泽乳","纸箱",null,"PCS",100,0,0,null,100]
[57,52,"郎顿","维斯蜜语醉红颜","套盒",null,"PCS",535,0,0,null,535]
[58,53,"郎顿","春之恋（次品）","套盒",null,"PCS",4,0,0,null,4]
[59,44,"郎顿","维斯润泽乳","瓶子","50ml","PCS",null,0,0]
[60,22,"郎顿","维斯润泽乳","泵头","50ml","PCS",2994,0,0,null,980]
[61,29,"郎顿","幻彩柔丝秘贴","铝袋",null,"PCS",3150,0,0,null,3150]
[62,68,"郎顿","幻彩柔丝秘贴","珠光膜",null,"PCS",0,0,0,null,13400]
[63,30,"郎顿","幻彩柔丝秘贴","膜布",null,"PCS",4500,0,0,null,19100]
[64,72,"郎顿","保险单",null,null,"PCS",2536,0,0,null,2536]
[65,73,"郎顿","素女经",null,null,"PCS",30,0,0,null,30]
[66,54,"郎顿","紧致如初","套盒标",null,"PCS",1040,0,0,null,1040]
[67,55,"郎顿","贵妃醉","套盒标",null,"PCS",340,0,0,null,340]
[68,56,"郎顿","维斯润泽乳","套盒标",null,"PCS",870,0,0,null,870]
[69,57,"郎顿","醉红颜","套盒标",null,"PCS",419,0,0,null,419]
[70,58,"郎顿","凝香露","套盒标",null,"PCS",1300,0,0,null,1300]
[71,59,"郎顿","维纳斯之吻","套盒标",null,"PCS",1100,0,0,null,1100]
[72,60,"郎顿","春之恋","套盒标",null,"PCS",443,0,0,null,443]
[73,42,"郎顿","梦幻爱洛蒙霜","瓶","30g","套",36,0,0,null,36]
[74,34,"郎顿","贵妃醉","牛油纸",null,"PCS",18,0,0,null,18]
[75,35,"郎顿","醉红颜","牛油纸",null,"PCS",610,0,0,null,610]
[76,36,"郎顿","春之恋","牛油纸",null,"PCS",20,0,0,null,20]
[77,17,"郎顿","印花","175分",null,"PCS",1000,0,0,null,1000]
[78,18,"郎顿","印花","800分",null,"PCS",800,0,0,null,800]
[79,37,"郎顿","维纳斯之吻","牛油纸",null,"PCS",1000,0,0,null,1000]
{"$rows_left_out":425}
{"sheet":"广州锦盛10月份包材仓电子帐 (2)","index":3,"n_rows":1716,"n_cols":114,"rows_kept":1716,"cut":false,"hidden":true,"merged":[[1,131,1,134],[1,135,1,138],[1,139,1,140],[1,0,2,0],[1,1,2,1],[1,2,2,2],[1,3,2,3],[1,4,2,4],[1,5,2,5],[1,6,2,6],[1,7,2,7],[1,8,2,8],[1,9,2,9],[1,10,2,10],[1,11,2,11],[1,12,2,12],[1,111,1,114],[1,115,1,118],[1,119,1,122],[1,123,1,126],[1,127,1,130],[1,91,1,94],[1,95,1,98],[1,99,1,102],[1,103,1,106],[1,107,1,110],[1,71,1,74],[1,75,1,78],[1,79,1,82],[1,83,1,86],[1,87,1,90],[1,51,1,54],[1,55,1,58],[1,59,1,62],[1,63,1,66],[1,67,1,70],[1,31,1,34],[1,35,1,38],[1,39,1,42],[1,43,1,46],[1,47,1,50],[0,0,0,13],[1,15,1,18],[1,19,1,22],[1,23,1,26],[1,27,1,30],[1,13,2,13],[1,14,2,14]]}
[]
[null,null,null,null,null,null,null,"物料编号","存储位置"]
[]
["苏杜全",null,"敖家睿","EGF多肽修护原液套","3件套","套盒","3件套",null,null,{"$f":"O4+K4-L4","v":0},{"$f":"Q4+U4+Y4+AC4+AG4+AK4+AO4+AS4+AW4+BA4+BE4+BI4+BM4+BQ4+BU4+BY4+CC4+CG4+CK4+CO4+CS4+CW4+DA4+DE4+DI4+DM4+DQ4+DU4+DY4+EC4+EG4","v":0},{"$f":"S4+W4+AA4+AE4+AI4+AM4+AQ4+AU4+AY4+BC4+BG4+BK4+BO4+BS4+BW4+CA4+CE4+CI4+CM4+CQ4+CU4+CY4+DC4+DG4+DK4+DO4+DS4+DW4+EA4+EE4+EI4","v":0},"PCS"]
["苏杜全",null,"敖家睿","EGF多肽修护原液套","3ml","支","3ml",null,null,0,0,0,"PCS"]
["苏杜全",null,"敖家睿","EGF多肽修护原液套","3ml","喇叭头","3ml",null,null,0,0,0,"PCS"]
["苏杜全",null,"敖家睿","EGF多肽修护原液套","3ml","白色植绒吸塑","3ml",null,null,0,0,0,"PCS"]
["苏杜全",null,"敖家睿","EGF多肽修护原液套","3ml","内托","3ml",null,null,0,0,0,"PCS"]
["苏杜全",null,"敖家睿","EGF多肽修护原液套","3ml","彩盒","3ml",null,null,0,0,0,"PCS"]
["苏杜全",null,"敖家睿","多肽修护原液","3ml","安瓶","3ml",null,null,0,0,0,"PCS"]
["苏杜全",null,"敖家睿","多肽修护原液","3ml","白色内盖","3ml",null,null,0,0,0,"PCS"]
["苏杜全",null,"敖家睿","多肽修护原液","3ml","白色铝盖","3ml",null,null,0,0,0,"PCS"]
["杨克江",null,"宝相花","77号空白纸箱","77#","专用纸箱","77#",null,null,0,0,0,"PCS",null,0]
["杨克江",null,"宝相花","78号空白纸箱","78#","专用纸箱","78#",null,null,0,0,0,"PCS",null,0]
["杨克江",null,"宝相花","魅力女人套","24件/套","套盒","24件/套",null,null,0,0,0,"PCS"]
["杨克江",null,"宝相花","魅力女人套","24件/套","说明书",null,null,null,0,0,0,"PCS",null,0]
["杨克江",null,"宝相花","魅力女人套","24件/套","收缩膜",null,null,null,0,0,0,"PCS",null,0]
["杨克江",null,"宝相花","明媚亮眼套","41件/套","套盒","41件/套",null,null,0,0,0,"PCS"]
["杨克江",null,"宝相花","明媚亮眼套","41件/套","说明书",null,null,null,0,0,0,"PCS",null,0]
["杨克江",null,"宝相花","明媚亮眼套","41件/套","收缩膜",null,null,null,0,0,0,"PCS",null,0]
["杨克江",null,"宝相花","柔肤按摩膏","50ML","红色玻璃瓶","50ML",null,null,0,0,0,"PCS",null,0]
["杨克江",null,"宝相花","柔肤按摩膏、柔肤水洗膜、柔肤精华霜、舒活多肽眼霜","50ML","手拉垫片","50ML",null,null,0,0,0,"PCS",null,0]
["杨克江",null,"宝相花","柔肤按摩膏、柔肤水洗膜、柔肤精华霜、舒活多肽眼霜","50ML","金色外盖","50ML",null,null,0,0,0,"PCS",null,0]
["杨克江",null,"宝相花","柔肤精华乳","3ML","折断瓶","3ML",null,null,0,0,0,"PCS",null,0]
["杨克江",null,"宝相花","柔肤精华霜","30G","红色玻璃瓶","30G",null,null,0,0,0,"PCS",null,0]
["杨克江",null,"宝相花","柔肤精华素","3ML","折断瓶","3ML",null,null,0,0,0,"PCS",null,0]
["杨克江",null,"宝相花","柔肤精华素、柔肤精华乳、舒活按摩精华、舒活滋养啫喱、舒活多肽精华","3ML","内塞","3ML",null,null,22850,0,0,"PCS",null,22850]
["杨克江",null,"宝相花","柔肤精华素、柔肤精华乳、舒活按摩精华、舒活滋养啫喱、舒活多肽精华","3ML","塞钉","3ML",null,null,22850,0,0,"PCS",null,22850]
["杨克江",null,"宝相花","柔肤爽肤水","100ML","红色玻璃瓶","100ML",null,null,0,0,0,"PCS",null,0]
["杨克江",null,"宝相花","柔肤爽肤水","100ML","喷雾头","100ML",null,null,0,0,0,"PCS",null,0]
["杨克江",null,"宝相花","柔肤爽肤水","100ML","金色外盖","100ML",null,null,0,0,0,"PCS",null,0]
["杨克江",null,"宝相花","柔肤水洗膜","50G","红色玻璃瓶","50G",null,null,0,0,0,"PCS",null,0]
["杨克江",null,"宝相花","舒活按摩精华","3ML","折断瓶","3ML",null,null,0,0,0,"PCS",null,0]
["杨克江",null,"宝相花","舒活多肽精华","3ML","折断瓶","3ML",null,null,0,0,0,"PCS",null,0]
["杨克江",null,"宝相花","舒活多肽眼膜","12ML*10片/盒","两层眼膜贴","12ML*10片/盒",null,null,0,0,0,"PCS",null,0]
["杨克江",null,"宝相花","舒活多肽眼膜","12ML*10片/盒","银色铝箔袋","12ML*10片/盒",null,null,5000,0,0,"PCS",null,5000]
["杨克江",null,"宝相花","舒活多肽眼膜","12ML*10片/盒","彩盒","12ML*10片/盒",null,null,0,0,0,"PCS",null,0]
["杨克江",null,"宝相花","舒活多肽眼霜","30G","红色玻璃瓶","30G",null,null,0,0,0,"PCS",null,0]
["杨克江",null,"宝相花","舒活滋养啫喱","3ML","折断瓶","3ML",null,null,0,0,0,"PCS",null,0]
["黄细娇",null,"本厂"," ","500ML","外罩","500ML",null,null,-252,0,0,"PCS",null,-252]
[]
[]
[]
[]
["黄细娇",null,"本厂","白色塑瓶","500ML","塑封膜","500ML",null,null,10000,0,0,"PCS",null,10000]
["黄细娇",null,"本厂","共用透明胶","1KG","透明胶","1kg",null,null,-330,0,330,"PCS",null,null,null,null,null,null,null,null,null,null,null,null,null,null,null,null,null,null,null,null,null,null,null,null,null,null,null,null,null,null,null,null,null,null,null,null,null,null,null,null,null,null,null,null,null,null,null,null,null,null,null,null,null,null,null,null,null,null,null,null,"0002969",300,null,null,null,null,null,null,"0003634",30]
["黄细娇",null,"本厂","泥 灸","100g","PP圆形塑料盒子","100g",null,null,-300,0,0,"PCS",null,-300]
["黄细娇",null,"本厂","透明塑瓶","500ML","塑封膜","500ML",null,null,9400,0,0,"PCS",null,9400]
["黄细娇",null,"本厂","香芬洋甘菊静肤冰晶","/","共用标签","/",null,null,-500,0,500,"PCS",null,null,null,null,null,null,null,null,null,null,null,null,null,null,null,null,null,null,null,null,null,null,null,null,null,null,null,null,null,null,null,null,null,null,null,null,null,null,null,null,null,null,null,null,null,null,null,null,null,null,null,null,null,null,null,null,null,null,null,null,"0002964",500]
["黄细娇",null,"本厂","新维素洋甘菊静肤花水","/","共用标签","/",null,null,-740,0,740,"PCS",null,null,null,null,null,null,null,null,null,null,null,null,null,null,null,null,null,null,null,null,null,null,null,null,null,null,null,null,null,null,null,null,null,null,null,null,null,null,null,null,null,null,null,null,null,null,null,null,null,null,null,null,null,null,null,null,null,null,null,null,"0002969",500,null,null,null,null,null,null,null,null,null,null,"0003005",200,null,null,"0003009",40]
["黄细娇",null,"本厂","香芬-玫瑰活颜洗面奶","1kg","透明袋","1kg",null,null,7100,0,800,"PCS",null,7900,null,null,null,null,null,null,null,null,null,null,null,null,null,null,null,null,null,null,null,null,null,null,null,null,null,null,null,null,null,null,null,null,null,null,null,null,null,null,null,null,null,null,null,null,null,null,null,null,null,null,null,null,null,null,null,null,null,null,"0002969",{"$f":"300+500","v":800}]
["黄细娇",null,"本厂","香芬-玫瑰活颜纯露","/","共用标签","/",null,null,0,0,0,"PCS"]
["黄细娇",null,"本厂","香芬-玫瑰活颜水洗膜","/","共用标签","/",null,null,0,0,0,"PCS"]
["黄细娇",null,"本厂","香芬-玫瑰活颜按摩膏","/","共用标签","/",null,null,0,0,0,"PCS"]
["黄细娇",null,"本厂","香芬-玫瑰活颜冰晶","/","共用标签","/",null,null,0,0,0,"PCS"]
["黄细娇",null,"本厂","香芬-玫瑰活颜乳液","/","共用标签","/",null,null,0,0,0,"PCS"]
["黄细娇",null,"本厂","香芬-玫瑰活颜霜","/","共用标签","/",null,null,0,0,0,"PCS"]
["黄细娇",null,"本厂","香芬-洋甘菊静肤洗面奶","/","共用标签","/",null,null,0,0,0,"PCS"]
["黄细娇",null,"本厂","香芬-洋甘菊静肤纯露","/","共用标签","/",null,null,0,0,0,"PCS"]
["黄细娇",null,"本厂","香芬-洋甘菊静肤水洗膜","/","共用标签","/",null,null,0,0,0,"PCS"]
["黄细娇",null,"本厂","香芬-洋甘菊静肤按摩膏","/","共用标签","/",null,null,0,0,0,"PCS"]
["黄细娇",null,"本厂","香芬-洋甘菊静肤冰晶","/","共用标签","/",null,null,0,0,0,"PCS"]
["黄细娇",null,"本厂","香芬-洋甘菊静肤乳液","/","共用标签","/",null,null,0,0,0,"PCS"]
["黄细娇",null,"本厂","香芬-洋甘菊静肤霜","/","共用标签","/",null,null,0,0,0,"PCS"]
["黄细娇",null,"本厂","维他命-补水保湿洗面奶","/","共用标签","/",null,null,0,0,0,"PCS"]
["黄细娇",null,"本厂","维他命-VC营养水","/","共用标签","/",null,null,0,0,0,"PCS"]
["黄细娇",null,"本厂","维他命-去角质啫喱","/","共用标签","/",null,null,0,0,0,"PCS"]
["黄细娇",null,"本厂","维他命-柔滑按摩膏","/","共用标签","/",null,null,{"$f":"O68+K68-L68","v":0},{"$f":"Q68+U68+Y68+AC68+AG68+AK68+AO68+AS68+AW68+BA68+BE68+BI68+BM68+BQ68+BU68+BY68+CC68+CG68+CK68+CO68+CS68+CW68+DA68+DE68+DI68+DM68+DQ68+DU68+DY68+EC68+EG68","v":0},{"$f":"S68+W68+AA68+AE68+AI68+AM68+AQ68+AU68+AY68+BC68+BG68+BK68+BO68+BS68+BW68+CA68+CE68+CI68+CM68+CQ68+CU68+CY68+DC68+DG68+DK68+DO68+DS68+DW68+EA68+EE68+EI68","v":0},"PCS"]
["黄细娇",null,"本厂","维他命-冰泉水洗膜","/","共用标签","/",null,null,0,0,0,"PCS"]
["黄细娇",null,"本厂","维他命-补水保湿精华素","/","共用标签","/",null,null,0,0,0,"PCS"]
["黄细娇",null,"本厂","维他命-补水保湿精华乳","/","共用标签","/",null,null,0,0,0,"PCS"]
[]
["黄细娇",null,"本厂","维他命-补水保湿按摩膏","/","共用标签","/",null,null,0,0,0,"PCS"]
["黄细娇",null,"本厂","新维素-清爽洁面露","/","共用标签","/",null,null,0,0,0,"PCS"]
["黄细娇",null,"本厂","新维素-玫瑰营养水","/","共用标签","/",null,null,0,0,0,"PCS"]
["黄细娇",null,"本厂","新维素洋-甘菊静肤花水","/","共用标签","/",null,null,0,0,0,"PCS"]
["黄细娇",null,"本厂","新维素-莹润水洗膜","/","共用标签","/",null,null,0,0,0,"PCS"]
["黄细娇",null,"本厂","新维素-水润按摩膏","/","共用标签","/",null,null,0,0,0,"PCS"]
["黄细娇",null,"本厂","新维素-柔滑按摩膏啫喱","/","共用标签","/",null,null,0,0,0,"PCS"]
["黄细娇",null,"本厂","新维素-润肤水晶面膜","/","共用标签","/",null,null,0,0,0,"PCS"]
{"$rows_left_out":1637}
{"sheet":"Sheet1","index":4,"n_rows":84,"n_cols":7,"rows_kept":84,"cut":false,"hidden":true,"merged":[[0,5,1,5],[0,6,1,6],[0,0,1,0],[0,1,1,1],[0,2,1,2],[0,3,1,3],[0,4,1,4]]}
["业 务","客户名称","产品名称","产品规格","物料名称","物料规格","本月结存"]
[]
["曾小根","高礼宾","花度-粉嫩娇颜套","24件/套","套盒","24件/套",-100]
["曾小根","高礼宾","花度-粉嫩娇颜套","24件/套","套盒名称标","24件/套",-100]
["曾小根","高礼宾","花度-粉嫩娇颜套","24件/套","塑封膜","38.5*52cm",-100]
["曾小根","高礼宾","花度-粉嫩娇颜套、花度-爱慕情缘套、花度-腹活能量SPA、醉花因-腹活能量SPA套盒、润羞-风尚柔情套盒、润羞-粉红诱惑、 花库-卿本佳人","24件/套","推杆",null,-200]
["曾小根","高礼宾","花度-凝香露套","30ml","喷雾泵头","30ml",-1000]
["曾小根","高礼宾","花度-性香原液","10ml","玻璃瓶","10ml",-1000]
["曾小根","高礼宾","花度-性香原液","10ml","名称标","10ml",-1000]
["曾小根","高礼宾","润羞-性香原液、醉花因-性香原液、花库-性香原液、花度-性香原液","10ml","13印花","10ml",-1000]
["曾小根","高礼宾","润羞-性香原液、醉花因-性香原液、花库-性香原液、花度-性香原液","10ml","塑缩膜","10ml",-1000]
["曾小根","高礼宾","润羞-性香原液、醉花因-性香原液、花库-性香原液、花度-性香原液","10ml","泵头","10ml",-1000]
["曾小根","王丽","合济堂泡浴养护粉（I号）/合济堂泡浴养护粉（II号）/合济堂泡浴养护粉（III号）/合济堂泡浴养护粉（IV号）/合济堂泡浴养护粉（V号）/合济堂泡浴养护粉（VI号）","100g","铝箔袋","100g",-200]
["曾小根","王丽","合济堂泡浴养护粉（VI号）","100g","品名标","100g",-251]
["杨克江","汤海飞","多肽雪肌霜","50g ","垫片","50g ",-11]
["杨克江","汤海飞","多肽雪肌霜","50g ","盖子","50g ",-9]
["杨克江","汤海飞","多肽雪肌霜","50g ","塑料瓶","50g ",-7]
["曾小根","刘铁成（朗顿）","幻彩柔丝秘贴1","10ml ","铝箔袋","10ml",-1600]
["曾小根","刘铁成（朗顿）","幻彩柔丝秘贴1","10ml ","唇膜","10ml",-1600]
["曾小根","刘铁成（朗顿）","幻彩柔丝秘贴1","10ml ","珠光膜","10ml",-1600]
["黄细娇","工厂","透明瓶","500ml","塑料瓶","500ml",-62]
["黄细娇","工厂","透明瓶","500ml","喷头","500ml",-62]
["黄细娇","工厂","透明袋","1kg","袋装","1kg",-100]
["林静","黄仲祥","水光嫩肤尊享套","21件套","镊子",null,-30]
["林静","黄仲祥","水光嫩肤尊享套","21件套","塑封膜",null,-35]
["林静","黄仲祥","水光嫩肤尊享套","21件套","垫片",null,-30]
["曾小根","马文英","玫瑰精油","10ml","茶色精油（烫金）","10ml",-100]
["曾小根","马文英","玫瑰精油","10ml","内塞","10ml",-100]
["曾小根","马文英","玫瑰精油","10ml","名称贴","10ml",-100]
["曾小根","马文英","玫瑰精油","10ml","垫片","10ml",-100]
["曾小根","马文英","玫瑰精油","10ml","螺纹金盖","10ml",-100]
["曾小根","马文英","玫瑰精油","10ml","标贴","10ml",-100]
["曾小根","马文英","玫瑰精油","10ml","茶色精油（烫银）","10ml",-100]
["曾小根","马文英","玫瑰精油","10ml","内塞","10ml",-100]
["曾小根","马文英","玫瑰精油","10ml","名称贴","10ml",-100]
["曾小根","马文英","玫瑰精油","10ml","垫片","10ml",-100]
["曾小根","马文英","蕴能精油","10ml ","茶色精油（烫银）","10ml ",-100]
["曾小根","马文英","蕴能精油","10ml ","内塞","10ml ",-100]
["曾小根","马文英","蕴能精油","10ml ","螺纹金盖","10ml ",-100]
["曾小根","马文英","蕴能精油","10ml ","垫片",null,-100]
["曾小根","马文英","蕴能精油","10ml ","名称标","10ml ",-100]
["曾小根","马文英","蕴能精油","10ml ","茶色精油（烫金）","10ml ",-100]
["曾小根","马文英","蕴能精油","10ml ","内塞","10ml ",-100]
["曾小根","马文英","蕴能精油","10ml ","垫片","10ml ",-100]
["曾小根","马文英","蕴能精油","10ml ","螺纹金盖","10ml ",-100]
["曾小根","马文英","蕴能精油","10ml ","名称标","10ml ",-100]
["曾小根","王丽","合济堂养颜美体药泡套","10件套","套盒","10件套",-480]
["曾小根","王丽","合济堂泡浴养护粉（II号）","100g","品名标","100g",-200]
["杨克江","王晓君","EGF生长因子复合液","5ML ","喇叭头+盖子","5ml",-100]
["曾小根","王丽","合济堂泡浴养护粉（VI号）","100g","品名标","100g",-251]
["曾小根","王丽","合济堂泡浴养护粉（V号）、合济堂泡浴养护粉（I号）、合济堂泡浴养护粉（II号）、合济堂泡浴养护粉（III号）、合济堂泡浴养护粉（VI号）","100g","说明书","100g",-1200]
["曾小根","王丽","合济堂泡浴养护粉（V号）、合济堂泡浴养护粉（I号）、合济堂泡浴养护粉（II号）、合济堂泡浴养护粉（III号）、合济堂泡浴养护粉（VI号）","100g","10积分卡","100g",-1200]
["杨克江","汤海飞","柳橙节亮颜皮膜液","40ml","红色玻璃瓶","40ml",-185]
["杨克江","汤海飞","柳橙节亮颜皮膜液","40ml","压嘴喷雾头","40ml",-185]
["杨克江","汤海飞","柳橙节亮颜皮膜液","40ml","外盖","40ml",-185]
["杨克江","汤海飞","柳橙节亮颜皮膜液","40ml","产品标贴","40ml",-185]
["杨克江","汤海飞","柳橙节亮颜皮膜液","40ml","成分标","40ml",-185]
["杨克江","汤海飞","柳橙节亮颜皮膜液","40ml","内托","40ml",-185]
["杨克江","汤海飞","柳橙节亮颜皮膜液","40ml","彩盒","40ml",-185]
["杨克江","汤海飞","柳橙节亮颜皮膜液","40ml","塑封膜","40ml",-185]
["杨克江","汤海飞","苹果节活性肽皮膜液","40ml","红色玻璃瓶","40ml",-185]
["杨克江","汤海飞","苹果节活性肽皮膜液","40ml","压嘴喷雾头","40ml",-185]
["杨克江","汤海飞","苹果节活性肽皮膜液","40ml","外盖","40ml",-185]
["杨克江","汤海飞","苹果节活性肽皮膜液","40ml","产品标贴","40ml",-185]
["杨克江","汤海飞","苹果节活性肽皮膜液","40ml","成分标","40ml",-185]
["杨克江","汤海飞","苹果节活性肽皮膜液","40ml","内托","40ml",-185]
["杨克江","汤海飞","苹果节活性肽皮膜液","40ml","彩盒","40ml",-185]
["杨克江","汤海飞","苹果节活性肽皮膜液","40ml","塑封膜","40ml",-185]
["杨克江","汤海飞","芒果节活性肽皮膜液","40ml","红色玻璃瓶","40ml",-185]
["杨克江","汤海飞","芒果节活性肽皮膜液","40ml","压嘴喷雾头","40ml",-185]
["杨克江","汤海飞","芒果节活性肽皮膜液","40ml","外盖","40ml",-185]
["杨克江","汤海飞","芒果节活性肽皮膜液","40ml","产品标贴","40ml",-185]
["杨克江","汤海飞","芒果节活性肽皮膜液","40ml","成分标","40ml",-185]
["杨克江","汤海飞","芒果节活性肽皮膜液","40ml","内托","40ml",-185]
["杨克江","汤海飞","芒果节活性肽皮膜液","40ml","彩盒","40ml",-185]
["杨克江","汤海飞","芒果节活性肽皮膜液","40ml","塑封膜","40ml",-195]
["杨克江","汤海飞","葡萄节多肽皮膜液","40ml","红色玻璃瓶","40ml",-195]
["杨克江","汤海飞","葡萄节多肽皮膜液","40ml","压嘴喷雾头","40ml",-195]
["杨克江","汤海飞","葡萄节多肽皮膜液","40ml","外盖","40ml",-195]
["杨克江","汤海飞","葡萄节多肽皮膜液","40ml","产品标贴","40ml",-195]
{"$rows_left_out":5}
{"sheet":"问题记录","index":5,"n_rows":5,"n_cols":2,"rows_kept":5,"cut":false,"hidden":false,"merged":[]}
[null,"云南翘楚6688的单在哪？"]
[null,"云南翘楚的有疑问"]
[null,"马文英中间缺页"]
[null,"吴龙因在数据上只有四个货品，有单未录入"]
[null,"昇凰的泌爱凝香滋润53个喷头和52个外盖领料未有数据处理；"]

{"sheet":"统计","index":6,"n_rows":22,"n_cols":5,"rows_kept":22,"cut":false,"hidden":false,"merged":[]}
[]
[]
["行标签","计数项:产品名称"]
["洁士宝",15,null,"洁士宝",15]
["郎顿",58,null,"郎顿",58]
["刘海平",14,null,"刘海平",14]
["马文英",98,null,"马文英",98]
["昇凰",11,"有退单","昇凰",11]
["苏眉",14,null,"苏眉",14]
["隋新城",25,null,"隋新城",25]
["田惠",12,null,"田惠",12]
["王琦",101,null,"王琦",101]
["文奇嘉美",16,null,"文奇嘉美",16]
["吴斌",11,null,"吴斌",11]
["吴彩霞",4,null,"吴彩霞",4]
["吴刚",6,null,"吴刚",6]
["吴龙因",4,null,"吴龙因",4]
["云南翘楚",67,null,"云南翘楚",67]
["张俊江",40,null,"张俊江",40]
["赵国民",null,null,"赵国民"]
["(空白)"]
["总计",496]

{"sheet":"Sheet2","index":7,"n_rows":3,"n_cols":4,"rows_kept":3,"cut":false,"hidden":false,"merged":[]}
[null,"客户名称","物料名称","公式结存"]
[null,"洁士宝","*彩*",1000]
[null,"郎顿",null,">3000"]